program: Gaussian 09
title: 000244908
version: EM64L-G09RevD.01
frameworkgroup: C1[X(C25H22Cl2N2O)]
method: RPBEPBE
basis: SDD
operation: Freq
keyword: #p
keyword: freq=noraman
keyword: PBEPBE/SDD
title: #p freq=noraman PBEPBE/SDD
converged: YES YES NO NO
title: Mulliken charges:
elementType: Cl Cl O N N C C C C C C C C C C C C C C C C C C C C C C C C C H H H H H H H H H H H H H H H H H H H H H H
charge: -0.062700 -0.061055 -0.158830 -0.133573 -0.077530 0.278888 0.284294 0.221036 0.223071 0.483509 -0.320302 -0.418196 -0.419622 -0.542197 -0.385075 0.346755 -0.596233 0.318806 0.241247 -0.405161 -0.373050 -0.420277 -0.381104 -0.426787 -0.556283 -0.556995 -0.217893 -0.402547 -0.236429 -0.834783 0.240701 0.276063 0.239532 0.278044 0.286888 0.245140 0.224875 0.246168 0.225879 0.278338 0.255356 0.275415 0.292310 0.266210 0.292936 0.265440 0.229365 0.230833 0.234630 0.238268 0.229500 0.237122
chargesum: 0.00000
title: Mulliken charges with hydrogens summed into heavy atoms:
elementType: Cl Cl O N N C C C C C C C C C C C C C C C C C C C C C C C C C
charge: -0.062700 -0.061055 -0.158830 -0.133573 -0.077530 0.278888 0.284294 0.221036 0.223071 0.483509 -0.320302 0.098568 0.097953 -0.255308 -0.139935 0.346755 -0.371358 0.318806 0.241247 -0.158993 -0.147171 -0.141940 -0.125748 -0.151371 0.002237 0.001381 0.011472 -0.171714 -0.001799 -0.129893
polarizability: 7.94129228e+02 1.19439798e+01 2.83136177e+02 3.00500710e+00 3.01787958e+01 1.79785181e+02
1716.lowfreq: -5.8528 -2.8054 -0.4067 0.0006 0.0014 0.0016 12.3019 15.8048 22.4233
frequency: 12.2739 15.7712 22.4221 32.0681 36.0019 52.9564 65.9025 75.6360 91.3199 98.5622 119.2286 126.5472 139.1742 141.2045 149.1861 153.8247 184.8382 188.3221 195.2777 223.1133 244.4999 260.6896 278.2485 287.0224 334.7644 373.4062 373.6569 381.5205 390.0836 405.8413 438.0706 440.8904 452.8645 462.9842 492.6136 497.0988 514.4627 525.4027 541.3639 545.4845 576.7024 588.7398 600.5850 602.3178 606.8571 612.9444 641.5485 675.5431 692.4256 721.7744 731.9948 741.5613 753.0353 785.2494 802.8394 816.8283 831.2853 834.6370 849.3401 853.5121 860.9508 870.6672 897.5735 919.7951 922.3541 925.9981 950.7846 955.3692 967.1668 968.6425 972.1403 986.4534 994.8968 997.0290 997.6933 1007.6168 1027.7441 1040.2639 1042.3872 1054.6146 1067.4652 1092.6566 1107.2889 1133.7267 1162.4241 1166.0525 1168.1762 1178.8492 1180.8387 1196.2985 1200.5363 1227.9096 1239.0219 1260.5004 1265.8476 1280.3005 1292.0687 1296.8261 1303.8593 1306.6108 1343.8907 1351.4678 1356.6591 1362.6640 1380.7313 1387.3132 1396.7494 1402.9608 1437.9101 1440.2912 1442.8158 1444.2740 1446.4782 1458.2416 1468.0345 1472.0612 1474.4770 1483.5988 1495.0301 1517.7101 1546.4126 1572.2572 1580.8095 1598.8151 1602.5595 1619.7505 1628.6828 1636.5677 2976.0812 2981.3280 2981.8697 2984.3368 3055.3007 3057.1820 3057.5154 3076.5892 3082.7259 3083.7752 3128.1153 3134.3839 3140.7756 3141.4601 3143.5455 3143.8579 3146.4391 3150.3675 3150.9665 3163.9345 3166.5324 3166.6698
redmass: 7.5043 8.5399 6.9118 8.5193 9.7527 5.8210 5.9977 6.3968 5.8432 4.3497 5.4053 3.2363 3.7693 1.5673 2.7204 4.4308 4.0514 4.2524 3.0879 4.8351 4.2699 5.5264 4.9648 4.3541 3.9906 3.7152 3.8777 4.7447 2.8105 3.4609 3.1879 3.9379 3.3859 3.0159 3.7735 4.2139 4.3757 3.5376 4.4816 3.3916 5.2549 3.4221 3.6750 4.0075 4.3104 5.1559 6.9483 4.9197 3.8536 5.9858 6.5949 2.9982 1.4901 2.7675 3.6549 1.4467 2.8637 3.9688 2.0559 1.5290 2.5197 1.8148 1.5069 1.9500 1.7874 2.5765 2.1993 2.6606 1.5197 1.8008 1.4282 1.4742 1.3621 2.9440 1.9659 1.8562 2.0414 2.5383 1.6397 1.6107 2.7767 1.9454 2.2382 1.6204 1.1602 1.3202 1.4863 1.9455 1.8032 1.4465 2.7130 2.3517 1.4177 1.4846 1.6679 1.4810 1.6411 1.5923 1.3619 1.1959 3.6765 1.5274 1.5326 2.3429 1.8551 3.7361 1.4379 1.9055 1.3584 1.1204 1.8849 2.6908 2.2334 3.1385 1.2520 1.0517 3.5611 1.4115 1.2239 2.4447 7.0626 5.5857 7.4660 7.0408 7.8787 7.4848 6.4501 10.3898 1.0604 1.0677 1.0622 1.0684 1.0580 1.0582 1.0975 1.0937 1.0932 1.0985 1.0860 1.0893 1.0902 1.0911 1.1069 1.0926 1.1062 1.0907 1.0949 1.0955 1.0967 1.0992
irintensity: 0.4259 0.4509 0.5035 1.3421 0.8386 0.4882 2.3018 2.5645 5.4967 3.6825 2.6267 1.9736 1.8253 0.9526 0.3010 1.1093 1.0246 0.5850 0.8274 8.9333 5.3249 3.6581 3.1352 2.0781 8.3789 6.5591 4.0402 0.5554 4.0428 1.5817 0.2111 1.8378 4.2118 18.8165 4.8257 16.6297 6.2069 14.3567 5.6825 6.6781 2.7787 3.0038 12.9987 7.5040 23.2983 4.0437 7.7819 8.8709 0.1996 0.3112 1.2776 2.5714 81.8702 25.2360 6.5567 27.4658 3.1897 42.8788 35.5285 28.2233 32.9129 0.4554 1.0072 117.9064 16.4381 2.8381 13.8594 1.4329 9.0676 26.7133 9.1168 10.8183 0.1495 11.8453 1.9250 4.1886 0.3326 16.2117 8.6048 2.3731 12.2573 4.2067 110.0886 16.2309 13.4919 5.7554 7.4800 28.6765 18.5257 4.7931 113.1149 24.8015 263.7877 5.0798 45.3170 8.4745 104.9514 37.5575 37.7849 22.5766 6.1711 275.3367 272.6407 4.0438 84.2260 4.3701 63.0575 21.4063 20.3263 1.4929 48.9004 14.8535 11.0645 122.7229 51.9103 14.4811 19.3170 12.6416 11.1865 386.7257 122.9168 780.2598 30.5429 35.5846 51.9762 163.0212 372.5548 85.1598 4.4518 25.5123 73.3564 36.0529 20.2759 16.2094 14.3407 1.2690 7.5131 27.9713 6.9605 13.6051 3.9202 5.0207 24.3351 31.1220 13.0383 22.4976 17.3197 11.9943 60.3318 17.3880
temp: 298.150 k
press: 1.00000 atm
elementType: 17 17 8 7 7 6 6 6 6 6 6 6 6 6 6 6 6 6 6 6 6 6 6 6 6 6 6 6 6 6 1 1 1 1 1 1 1 1 1 1 1 1 1 1 1 1 1 1 1 1 1 1
symmnumber: 1
zpe: 1062491.4 jmol-1
zpe.correction: 0.404682 hartree
zpe.thermalcorrener: 0.431886 hartree
zpe.thermalcorrenthalpy: 0.432830 hartree
zpe.thermalcorrgfe: 0.342931 hartree
zpe.sumelectzpe: -2068.609854 hartree
zpe.sumelectthermal: -2068.582650 hartree
zpe.sumelectthermalent: -2068.581705 hartree
zpe.sumelectthermalfe: -2068.671604 hartree
dipole: 1.8027 -2.1103 0.8951
dipole: 2.9162
quadrupole: -168.2654 -186.2953 -192.3689
quadrupole: 19.9418 1.3250 15.4209
quadrupole: 14.0445 -3.9854 -10.0590 19.9418 1.3250 15.4209
hfenergy: -2069.0145351 hartree
pointgroup: C01 [X(C25H22Cl2N2O1)]
dipole: -0.7214327 0.8863466 0.1014943 debye
polarizability: 793.8079585|17.7601553|260.3042583|6.0854076|-52.3290551|202.9383702 unknown
InChI: InChI=1S/C25H22Cl2N2O/c1-17-14-20(29(12-10-26)13-11-27)8-6-18(17)16-28-19-7-9-22-21-4-2-3-5-23(21)25(30)24(22)15-19/h2-9,14-16H,10-13H2,1H3
charge 0 multiplicity 1
52 atoms
Cl -8.211136 2.555215 0.312812
Cl -7.951018 -2.716215 -0.988165
O  4.604294 -2.479869 0.978048
N  -6.167795 -0.030315 -0.141185
N  0.299038 0.844857 -0.378726
C  4.555469 0.916015 -0.244222
C  6.012524 0.660631 -0.110232
C  3.850003 -0.257539 0.161737
C  6.196758 -0.671183 0.375504
C  -4.773892 0.015098 0.010344
C  4.848413 -1.311738 0.566005
C  -6.834657 0.649953 -1.263482
C  -7.018609 -0.750009 0.819876
C  2.454243 -0.333074 0.143816
C  3.832423 2.036806 -0.694362
C  -2.723537 -0.589986 1.291843
C  -4.120251 -0.628081 1.110315
C  -1.909467 0.107323 0.339235
C  1.709508 0.811602 -0.291663
C  7.131043 1.472517 -0.370618
C  -3.942046 0.710104 -0.9297
C  7.473671 -1.203135 0.60636
C  2.419782 1.970617 -0.725733
C  -2.555613 0.743837 -0.759854
C  -6.994332 2.166781 -1.086824
C  -7.057293 -2.272214 0.621944
C  8.427078 0.937063 -0.139224
C  -0.455107 0.174109 0.470555
C  8.602081 -0.383263 0.342818
C  -2.122117 -1.297545 2.497602
H  -6.273321 0.473966 -2.203248
H  -7.824526 0.18881 -1.413403
H  -6.676309 -0.549152 1.855232
H  -8.040734 -0.342234 0.757063
H  1.95195 -1.26447 0.428245
H  4.342089 2.947787 -1.026578
H  -4.707491 -1.173084 1.855335
H  7.018209 2.496518 -0.743076
H  -4.375298 1.221812 -1.793143
H  7.585312 -2.226778 0.979107
H  1.826647 2.818396 -1.083093
H  -1.921028 1.272494 -1.478733
H  -6.058419 2.666246 -0.799085
H  -7.429254 2.632566 -1.984944
H  -6.056814 -2.717141 0.525381
H  -7.634486 -2.767516 1.418388
H  9.308411 1.557569 -0.337786
H  -0.008681 -0.350892 1.338543
H  9.61292 -0.769701 0.5110
H  -1.57126 -0.596339 3.151802
H  -2.90966 -1.770713 3.107978
H  -1.411713 -2.090606 2.197892
