program: Gaussian 09
title: 000244902
version: EM64L-G09RevD.01
frameworkgroup: C1[X(C18H20Cl2N2O)]
method: RPBEPBE
basis: SDD
operation: Freq
keyword: #p
keyword: freq=noraman
keyword: PBEPBE/SDD
title: #p freq=noraman PBEPBE/SDD
converged: YES YES NO NO
title: Mulliken charges:
elementType: Cl Cl O N N C C C C C C C C C C C C C C C C C C H H H H H H H H H H H H H H H H H H H H
charge: -0.065239 -0.063856 -0.433674 -0.135132 -0.082787 0.483884 -0.417794 -0.418654 -0.598252 0.347195 -0.375160 0.314354 -0.428630 -0.556256 -0.557418 -0.838184 -0.406732 0.243764 -0.315991 -0.351796 -0.347348 -0.362746 0.275369 0.239592 0.274080 0.238394 0.276151 0.223036 0.223794 0.274872 0.293188 0.264502 0.293338 0.263534 0.228331 0.231575 0.237845 0.220101 0.237204 0.251685 0.248160 0.218811 0.352890
chargesum: 0.00000
title: Mulliken charges with hydrogens summed into heavy atoms:
elementType: Cl Cl O N N C C C C C C C C C C C C C C C C C C
charge: -0.065239 -0.063856 -0.080784 -0.135132 -0.082787 0.483884 0.095879 0.095892 -0.375216 0.347195 -0.151366 0.314354 -0.153758 0.001434 -0.000546 -0.140433 -0.186632 0.243764 -0.078787 -0.100112 -0.099188 -0.143935 0.275369
polarizability: 5.32518504e+02 9.40981498e+00 2.01171802e+02 -7.85498195e+00 -2.90285409e+01 1.55675643e+02
1716.lowfreq: -6.1514 -0.8089 -0.0009 -0.0001 0.0012 3.9093 17.4934 21.2909 30.8860
frequency: 17.4360 21.2460 30.8184 35.6436 44.8664 62.6916 77.1451 87.7546 91.2004 116.0157 140.9652 155.4181 173.4177 179.2010 193.8795 202.9242 239.8187 251.1016 284.0162 335.1231 348.5051 363.2016 380.2724 390.7020 399.2109 414.8731 421.3543 451.0233 466.5715 480.8209 511.9293 524.5282 542.1497 547.3395 572.3456 598.5201 601.5300 607.6873 635.3474 675.4626 717.7335 743.3269 752.7118 801.4924 803.5711 820.3389 823.4255 831.1622 855.9733 863.1818 870.7180 919.6366 925.9431 933.6293 946.6857 949.7969 961.0788 987.0057 994.7695 997.2547 1007.7053 1040.0112 1041.8128 1055.1796 1097.2423 1104.2207 1142.3269 1161.3674 1163.7081 1169.0492 1180.0341 1192.9192 1196.7864 1238.1068 1245.0746 1261.5228 1274.2485 1291.0896 1300.6854 1305.7508 1307.2443 1350.3123 1353.7673 1356.7559 1377.1117 1380.7907 1394.3064 1400.8419 1428.6666 1437.6636 1440.5873 1444.3153 1467.1130 1472.1157 1480.7569 1491.6694 1496.0982 1517.5158 1546.9666 1575.8642 1578.0610 1624.8770 1628.9414 2968.6609 2975.9173 2978.0347 2981.6208 3055.4633 3055.8999 3056.1522 3074.1818 3080.7370 3082.2719 3113.6502 3132.2341 3142.4692 3144.6820 3145.4421 3148.9024 3162.9531 3165.0147 3167.9359 3583.6857
redmass: 10.1493 4.6013 7.1796 7.2850 8.7539 5.1258 5.4853 5.8539 5.4367 3.4316 4.5342 1.2792 3.8922 3.5058 3.2307 3.6187 4.1354 4.1839 3.6881 3.8854 1.1295 3.8949 3.2389 4.0298 3.1161 3.0608 3.9350 3.7467 3.0064 3.5709 2.7409 2.7811 3.2725 3.9469 4.1418 3.3714 4.3312 3.9021 6.8540 4.7750 3.6699 3.1660 5.7584 1.7708 2.0301 1.5011 1.7454 3.7375 1.4823 3.9389 1.8105 1.9766 2.5308 1.3639 1.3542 2.2171 1.5396 1.3916 2.6606 1.6325 1.8574 2.2160 1.8170 1.6063 1.4089 2.4033 1.3654 1.2660 1.1620 1.4807 1.8245 1.9387 1.6069 1.4259 2.5607 1.5263 1.8810 1.4703 1.3015 1.4394 1.1871 1.6301 1.5518 1.7015 4.1082 1.8523 1.4469 1.9170 3.6974 1.4542 1.1136 1.5828 1.1264 1.0468 1.4764 1.5905 1.5383 2.5411 7.2279 5.4053 6.3776 6.4375 6.3953 1.0787 1.0687 1.0431 1.0685 1.0975 1.0583 1.0579 1.0932 1.0930 1.0985 1.0898 1.0885 1.0910 1.1050 1.1064 1.0937 1.0944 1.0954 1.0958 1.0660
irintensity: 0.0132 0.3939 1.1939 0.3971 0.6584 0.9460 5.5266 3.5300 2.3374 4.4380 3.0036 1.8902 1.7806 1.9290 3.9864 1.7908 3.5874 4.1027 2.5118 8.5820 142.7364 26.9271 1.4643 0.3819 11.6300 5.2146 4.3542 2.8427 13.1147 16.1843 12.9189 35.6172 1.6731 12.4634 3.3404 5.5167 12.1402 24.5413 1.0709 1.7913 2.7851 1.7799 22.7965 26.0710 25.6725 8.1153 81.6935 6.3365 25.1106 12.0657 0.4877 99.7816 1.7134 1.9692 1.4856 13.4175 12.1725 5.0110 3.4701 0.6684 4.3063 16.3821 12.1595 0.7116 59.9623 83.0337 350.6820 1.7462 14.0193 5.7852 39.7362 34.3520 5.7556 193.9853 11.4052 5.6130 41.7156 75.8880 1.4126 25.2176 23.5116 34.9471 366.5443 7.4840 23.8875 21.5128 51.2801 15.7863 20.7406 16.0115 1.5173 10.8242 24.7947 11.6432 18.4318 43.7343 54.5176 345.1555 28.9746 224.0892 19.2573 392.1857 143.2408 33.8195 36.1739 56.5744 30.6215 16.5582 34.1587 3.1532 1.8185 7.9274 26.5354 34.7383 8.6229 16.6659 40.4843 17.1917 12.0047 11.7704 26.6334 6.8531 80.5203
temp: 298.150 k
press: 1.00000 atm
elementType: 17 17 8 7 7 6 6 6 6 6 6 6 6 6 6 6 6 6 6 6 6 6 6 1 1 1 1 1 1 1 1 1 1 1 1 1 1 1 1 1 1 1 1
symmnumber: 1
zpe: 893673.8 jmol-1
zpe.correction: 0.340382 hartree
zpe.thermalcorrener: 0.363339 hartree
zpe.thermalcorrenthalpy: 0.364283 hartree
zpe.thermalcorrgfe: 0.284481 hartree
zpe.sumelectzpe: -1801.066468 hartree
zpe.sumelectthermal: -1801.043511 hartree
zpe.sumelectthermalent: -1801.042567 hartree
zpe.sumelectthermalfe: -1801.122368 hartree
dipole: -0.8582 0.1568 0.8323
dipole: 1.2058
quadrupole: -150.6839 -140.5342 -152.9070
quadrupole: 13.8668 -1.5360 -16.3374
quadrupole: -2.6422 7.5075 -4.8653 13.8668 -1.5360 -16.3374
hfenergy: -1801.4068499 hartree
pointgroup: C01[X(C18H20Cl2N2O1)]
dipole: 0.3443016 -0.1228229 0.3023345 debye
polarizability: 532.6043469|10.9158985|188.2383198|2.4974738|35.4599724|168.5232822 unknown
InChI: InChI=1S/C18H20Cl2N2O/c1-14-12-17(22(10-8-19)11-9-20)5-2-15(14)13-21-16-3-6-18(23)7-4-16/h2-7,12-13,23H,8-11H2,1H3
charge 0 multiplicity 1
43 atoms
Cl 5.947593 -2.833307 0.466582
Cl 6.101886 2.362396 -1.209679
O  -8.038806 -0.074034 -0.029923
N  4.13166 -0.117069 -0.157618
N  -2.390041 -0.469345 -0.283581
C  2.738387 -0.033744 0.006982
C  4.721607 -0.930522 -1.231635
C  5.050061 0.599786 0.739146
C  2.154712 0.738268 1.061272
C  0.760715 0.833096 1.251597
C  1.839462 -0.719089 -0.87538
C  -0.121188 0.143189 0.357415
C  0.456232 -0.62167 -0.696059
C  4.74899 -2.439202 -0.947603
C  5.199186 2.09761 0.435127
C  0.2354 1.671998 2.408141
C  -1.577968 0.208645 0.501977
C  -3.798394 -0.332428 -0.185706
C  -4.4685 0.862145 0.222291
C  -4.5910 -1.445783 -0.578972
C  -5.872661 0.927017 0.263958
C  -5.997044 -1.395206 -0.523157
C  -6.638886 -0.205857 -0.097124
H  4.16534 -0.772289 -2.17779
H  5.746667 -0.572397 -1.421914
H  4.711962 0.497376 1.790578
H  6.038447 0.113477 0.694089
H  2.79448 1.281487 1.763421
H  2.217121 -1.32499 -1.703647
H  -0.230239 -1.142989 -1.371432
H  3.77697 -2.830037 -0.615092
H  5.127263 -3.005971 -1.812754
H  4.232818 2.607126 0.314916
H  5.821681 2.603259 1.189927
H  1.067439 2.114496 2.981763
H  -0.405584 2.50213 2.056058
H  -0.368979 1.068028 3.110286
H  -1.966604 0.841896 1.324978
H  -3.886225 1.756994 0.470862
H  -4.075473 -2.349741 -0.91764
H  -6.393015 1.843519 0.558176
H  -6.589523 -2.271326 -0.818231
H  -8.483147 -0.910041 -0.316701
