program: Gaussian 09
title: 000244894
version: EM64L-G09RevD.01
frameworkgroup: C1[X(C20H18O3)]
method: RPBEPBE
basis: SDD
operation: Freq
keyword: #pfreq=noraman
keyword: PBEPBE/SDD
title: #p freq=noraman PBEPBE/SDD
converged: YES YES NO NO
title: Mulliken charges:
elementType: O O O C C C C C C C C C C C C C C C C C C C C H H H H H H H H H H H H H H H H H H
charge: -0.265849 -0.265580 -0.153579 0.256932 0.322340 -0.342528 -0.364969 0.024005 -0.508476 -0.528615 -0.412035 0.441201 0.445451 -0.388617 -0.350265 -0.389795 -0.404578 -0.234647 -0.240302 -0.230866 -0.242612 -0.237169 -0.237063 0.260013 0.229984 0.228206 0.247891 0.229535 0.235588 0.221967 0.223256 0.275670 0.293649 0.245570 0.230175 0.230768 0.234339 0.228448 0.228899 0.231777 0.231881
chargesum: 0.00000
title: Mulliken charges with hydrogens summed into heavy atoms:
elementType: O O O C C C C C C C C C C C C C C C C C C C C
charge: -0.265849 -0.265580 -0.153579 0.256932 0.322340 -0.082515 -0.134985 0.024005 -0.032379 -0.063492 0.033187 0.441201 0.445451 -0.112947 -0.056616 -0.144225 -0.174402 -0.003880 -0.005963 -0.002418 -0.013713 -0.005392 -0.005182
polarizability: 2.31840962e+02 4.49666891e+00 2.33630977e+02 -2.19532004e+01 -9.26262731e+00 1.71369176e+02
1716.lowfreq: -6.0408 -2.6522 -0.0005 -0.0002 0.0003 3.8631 14.5816 27.1691 45.0092
frequency: 13.9828 26.9936 45.0020 53.0533 67.5955 81.8090 100.8426 122.2018 156.5676 179.3631 203.0976 241.6080 266.0139 290.3258 305.5056 341.7743 371.6774 380.8574 386.0271 399.2723 405.8769 407.6619 425.7338 491.2401 510.0393 517.0149 569.6557 600.9009 613.3949 614.5086 615.0804 652.8017 694.7575 703.2763 710.4873 733.5313 752.4829 768.7498 783.9176 797.0020 822.0804 832.7431 852.3019 857.1850 864.1165 879.7496 896.5389 917.2715 928.4504 934.5403 957.0257 979.8506 987.3435 988.1768 988.9641 1000.1611 1002.0759 1026.2904 1026.4759 1030.9470 1063.9041 1068.6546 1077.0801 1082.8212 1084.6188 1113.8027 1165.4265 1173.3097 1173.4722 1175.4738 1186.1323 1188.7148 1207.7138 1212.9717 1232.5751 1259.7925 1270.5760 1302.4973 1313.8033 1315.0549 1329.1138 1336.4668 1347.4401 1365.2649 1366.7360 1387.3411 1388.5916 1440.5055 1442.3843 1466.3529 1470.8137 1475.8537 1485.0270 1485.2203 1588.8992 1589.6074 1612.8503 1613.6781 1615.4355 2989.8140 2991.2704 2993.2111 3050.3447 3052.1061 3056.5200 3064.1665 3074.6285 3111.5689 3117.8672 3129.5655 3131.1284 3141.1439 3144.5720 3152.7574 3160.6171 3166.2179 3176.0511
redmass: 6.2775 4.5458 4.1270 4.6504 4.7106 4.4769 6.2128 3.5295 5.9833 3.6287 5.6984 3.2348 5.8433 4.1393 4.4538 3.8778 2.9742 5.0778 5.4149 5.5131 3.0038 2.9916 5.6246 3.9498 4.2796 3.3239 4.1329 5.4803 5.9172 6.3384 6.0972 3.0751 5.5249 2.0761 1.8273 3.5793 2.7246 2.1526 2.7133 3.9642 4.0129 4.3308 4.5321 1.2528 1.2513 1.6952 2.4121 2.8491 1.4641 1.4151 3.8611 1.4458 1.5383 4.3155 4.6157 1.3276 1.3097 2.1405 2.1331 1.5320 1.8355 1.8240 1.5560 1.5852 1.6103 1.5770 1.8137 1.1571 1.0705 2.1989 1.1180 1.1203 2.3534 2.7100 1.6020 1.6837 1.6105 1.9100 1.5160 1.5081 1.4723 1.4954 1.4230 2.2647 2.5529 5.2454 4.6002 2.1808 2.1520 1.0876 1.0842 1.0915 2.3770 2.3928 5.9796 6.0583 7.5583 5.9803 8.6107 1.0669 1.0617 1.0602 1.0905 1.0959 1.0988 1.1019 1.0886 1.0879 1.0876 1.0867 1.0875 1.0917 1.0928 1.0956 1.0976 1.1013 1.0973
irintensity: 0.0395 0.3141 0.5613 0.1175 0.5528 0.4467 2.1584 1.0731 1.8295 0.5357 0.5140 5.0642 3.7776 2.1452 0.7930 0.7318 2.4577 0.9435 0.8909 0.5669 0.1470 0.2333 1.0735 7.8988 6.0061 4.8988 22.5021 11.9081 2.2248 0.8603 1.7559 5.6262 7.7018 38.4355 50.7592 32.9331 148.9491 22.2306 8.6043 5.8441 21.8868 19.7268 11.6414 0.4165 0.7344 0.1781 9.2420 20.6661 0.4569 5.9626 37.8035 1.5672 0.3563 0.1369 0.2749 1.9119 0.2307 5.9116 7.4165 6.9362 7.2909 5.3855 14.5936 3.5691 6.0584 30.4635 10.3919 0.5789 0.0954 3.7056 1.2113 1.6054 2.3487 7.0547 8.8079 3.1498 9.3154 13.9646 5.3968 15.1569 2.3205 2.3435 1.4141 16.0844 30.9652 4.2757 1.7967 8.6122 16.2394 11.5903 15.3081 12.3254 11.1846 6.5273 1.4631 0.7490 44.7330 0.9483 64.5815 19.6458 20.7077 23.5692 3.8814 51.7691 21.9743 23.9149 6.9165 9.2878 4.1793 0.5751 2.6630 15.9581 25.3476 20.2623 20.3426 24.8873 7.1156
temp: 298.150 k
press: 1.00000 atm
elementType: 8 8 8 6 6 6 6 6 6 6 6 6 6 6 6 6 6 6 6 6 6 6 6 1 1 1 1 1 1 1 1 1 1 1 1 1 1 1 1 1 1
symmnumber: 1
zpe: 851463.0 jmol-1
zpe.correction: 0.324305 hartree
zpe.thermalcorrener: 0.343574 hartree
zpe.thermalcorrenthalpy: 0.344518 hartree
zpe.thermalcorrgfe: 0.274709 hartree
zpe.sumelectzpe: -996.889612 hartree
zpe.sumelectthermal: -996.870343 hartree
zpe.sumelectthermalent: -996.869399 hartree
zpe.sumelectthermalfe: -996.939208 hartree
dipole: 3.0470 1.6844 -5.0121
dipole: 6.1027
quadrupole: -136.3782 -120.7708 -137.9797
quadrupole: -7.2788 -2.9861 5.7100
quadrupole: -4.6687 10.9388 -6.2701 -7.2788 -2.9861 5.7100
hfenergy: -997.213917 hartree
pointgroup: C01 [X(C20H18O3)]
dipole: 1.2387932 -0.5884299 1.97076 debye
polarizability: 233.080214|-3.2747827|232.0345498|18.4945411|-16.0479818|171.7263508 unknown
InChI: InChI=1S/C20H18O3/c21-18-19(16(22-19)14-8-3-1-4-9-14)12-7-13-20(18)17(23-20)15-10-5-2-6-11-15/h1-6,8-11,16-17H,7,12-13H2
charge 0 multiplicity 1
41 atoms
O  1.33526 1.046797 -2.183636
O  -2.9366 2.150245 0.406996
O  -1.495382 1.365209 -1.976878
C  0.686862 1.423102 -0.881986
C  -1.441996 2.051744 0.371029
C  1.125938 -0.024878 -1.158512
C  -2.274383 1.025579 1.150956
C  -0.822317 1.625514 -0.949471
C  1.486987 2.375408 -0.000026
C  -0.668164 3.108399 1.151928
C  0.792099 2.640076 1.357186
C  2.321855 -0.661143 -0.531804
C  -2.544861 -0.378778 0.721005
C  3.636762 -0.207928 -0.808196
C  -3.215544 -0.676626 -0.492808
C  2.133605 -1.762426 0.345008
C  -2.131875 -1.440855 1.569388
C  4.746746 -0.838349 -0.203746
C  -3.452132 -2.020754 -0.855822
C  3.244126 -2.385643 0.953253
C  -2.364337 -2.783152 1.199594
C  4.554427 -1.92378 0.68252
C  -3.025032 -3.076671 -0.017223
H  0.302194 -0.706369 -1.418941
H  -2.248768 1.179267 2.242017
H  1.597175 3.331638 -0.549376
H  2.50316 1.974306 0.157151
H  -1.171552 3.290832 2.118837
H  -0.683556 4.064508 0.592624
H  0.808743 1.721943 1.976418
H  1.356966 3.412638 1.91025
H  3.773088 0.612658 -1.520976
H  -3.544285 0.147679 -1.13232
H  1.118714 -2.130137 0.543784
H  -1.633912 -1.216255 2.521717
H  5.760327 -0.489412 -0.43027
H  -3.972185 -2.242637 -1.793976
H  3.091123 -3.234701 1.628747
H  -2.044586 -3.596078 1.861225
H  5.416593 -2.413203 1.149057
H  -3.212784 -4.117668 -0.303024
