program: Gaussian 09
title: 000244891
version: EM64L-G09RevD.01
frameworkgroup: C1[X(C16H25NO)]
method: RPBEPBE
basis: SDD
operation: Freq
keyword: #p
keyword: freq=noraman
keyword: PBEPBE/SDD
title: #p freq=noraman PBEPBE/SDD
converged: YES YES NO NO
title: Mulliken charges:
elementType: O N C C C C C C C C C C C C C C C C H H H H H H H H H H H H H H H H H H H H H H H H H
charge: -0.199984 -0.164259 0.199611 -0.431382 0.118993 0.329758 -0.517405 -0.365836 -0.739634 -0.638872 -0.653066 -0.386629 -0.359654 -0.347894 -0.256646 -0.258801 -0.695060 -0.244430 0.227399 0.203395 0.251273 0.230862 0.192936 0.229178 0.212465 0.240504 0.243623 0.244361 0.239270 0.201116 0.214111 0.230129 0.228064 0.236718 0.278371 0.192528 0.192943 0.224572 0.227882 0.214233 0.216101 0.210398 0.228753
chargesum: 0.00000
title: Mulliken charges with hydrogens summed into heavy atoms:
elementType: O N C C C C C C C C C C C C C C C C
charge: -0.199984 -0.164259 0.199611 -0.000587 0.118993 0.329758 -0.035270 0.056279 -0.043042 0.045875 0.019238 -0.149911 -0.081283 0.037578 -0.032073 -0.030919 -0.054327 -0.015677
polarizability: 2.02610004e+02 2.89502265e+00 1.93352704e+02 4.10561156e+00 -3.41079873e+00 1.41376670e+02
1716.lowfreq: -13.5325 -8.4614 0.0003 0.0006 0.0007 7.6806 21.7169 37.6575 61.3097
frequency: 21.6569 37.2387 61.3060 69.6084 84.8215 96.8120 110.3028 124.2197 149.7912 173.7435 178.4221 186.0901 204.4668 211.3735 217.9192 223.1809 232.3545 273.3018 303.6194 313.1526 320.1172 361.7645 382.4731 384.6326 410.6368 424.5593 477.5579 509.0898 534.3554 582.2705 616.4248 655.5006 708.9365 716.9382 727.1316 758.2609 765.2901 795.1701 853.5944 856.7224 876.1192 897.0596 917.7963 925.1011 954.4255 982.4510 986.4538 991.4725 999.1434 1002.2797 1029.5964 1044.1141 1045.4382 1067.6739 1071.2955 1080.8417 1084.4120 1090.0704 1096.7469 1114.1125 1132.2805 1149.6155 1172.1302 1180.3875 1194.2392 1200.7178 1227.0556 1248.7675 1262.0770 1275.3747 1286.9542 1300.5283 1320.1922 1324.7534 1338.4267 1353.5248 1374.1196 1385.2111 1388.6286 1417.4782 1432.7805 1435.9404 1440.7827 1456.6751 1465.2951 1467.8086 1467.9398 1475.0067 1476.0590 1478.7270 1483.5968 1487.2916 1488.5363 1497.5573 1505.2733 1587.4775 1603.4917 1611.6845 2914.6833 2950.9054 2953.9199 2962.2943 2973.5912 2978.1341 2985.6554 2991.9165 3007.7337 3023.8575 3025.2431 3028.6203 3050.3593 3056.8850 3071.0636 3073.5516 3078.4912 3081.6101 3098.8634 3100.8064 3122.3271 3131.5920 3147.3455 3158.5156 3167.8248
redmass: 4.5773 3.2221 4.0596 1.5798 3.5504 3.3011 2.9195 2.3487 2.4163 2.0687 1.7602 2.3271 1.9565 1.3117 1.5705 1.1932 2.1675 2.3284 3.3240 3.2069 3.5871 3.3966 3.3646 3.9800 2.8922 2.6512 3.1450 3.2223 3.0622 2.7313 6.3719 4.5452 1.7794 5.6800 1.1265 1.5062 1.8739 1.2958 3.2202 1.2652 1.9730 1.8561 1.5829 1.4287 2.8964 1.3704 3.7927 3.4580 2.1264 1.4308 2.2887 2.4253 1.5366 2.0682 1.9550 2.1251 1.3893 1.5754 1.8902 2.3114 2.0105 1.8018 1.0522 3.2256 1.1234 1.5989 2.7937 1.3880 2.1086 1.2561 1.0921 1.3308 1.3575 1.3941 1.3612 1.5986 7.1297 1.2133 1.2145 1.1313 2.1533 1.1023 1.1621 1.0536 1.0513 1.0704 1.0705 1.0425 1.0712 1.5172 1.3049 1.0551 1.0822 1.0520 1.0538 6.0218 7.9284 6.5889 1.0496 1.0384 1.0661 1.0594 1.0371 1.0644 1.0549 1.0450 1.0973 1.0884 1.0934 1.0918 1.0967 1.0985 1.1004 1.0996 1.0978 1.0972 1.0955 1.1000 1.0846 1.0886 1.0927 1.0956 1.0988
irintensity: 0.4543 0.3162 1.1471 0.0928 0.5342 0.2218 0.1087 1.6095 0.4176 0.6150 0.9991 1.4261 2.5780 0.8121 0.1702 0.0051 0.2852 0.6125 0.7860 1.8658 6.6656 1.0222 1.7272 8.0273 0.1789 4.5976 2.0468 6.1151 7.3102 4.5397 0.0478 3.1479 43.8373 15.1553 8.5479 26.4885 35.2702 3.4822 13.4312 0.8663 9.2724 7.6851 1.7213 1.4539 5.7287 1.6664 34.6054 31.8263 22.0018 1.2798 6.6830 7.6360 13.3925 8.4213 1.6049 1.1268 1.2166 6.4953 0.2935 29.9565 14.5739 11.7153 0.2932 6.9016 1.1663 1.4751 7.5077 33.5817 1.6000 1.6392 2.1731 8.0670 0.0245 20.2498 2.7907 2.1962 1.2862 20.0484 13.9094 4.3978 9.2795 5.5708 22.1901 4.9003 13.1659 0.8396 8.2990 12.6296 1.4578 11.0605 14.8823 7.6723 26.3845 9.1869 7.2438 1.2436 63.5775 17.3463 79.7216 88.7756 9.0713 24.3256 29.3454 52.5063 35.6233 31.7714 14.9313 74.7842 5.0826 5.9580 11.1384 21.7412 87.4493 54.5492 27.3836 43.9349 22.8534 37.1766 0.9141 8.3954 31.3203 23.7086 12.6369
temp: 298.150 k
press: 1.00000 atm
elementType: 8 7 6 6 6 6 6 6 6 6 6 6 6 6 6 6 6 6 1 1 1 1 1 1 1 1 1 1 1 1 1 1 1 1 1 1 1 1 1 1 1 1 1
symmnumber: 1
zpe: 980349.2 jmol-1
zpe.correction: 0.373395 hartree
zpe.thermalcorrener: 0.393744 hartree
zpe.thermalcorrenthalpy: 0.394689 hartree
zpe.thermalcorrgfe: 0.324360 hartree
zpe.sumelectzpe: -753.242098 hartree
zpe.sumelectthermal: -753.221749 hartree
zpe.sumelectthermalent: -753.220805 hartree
zpe.sumelectthermalfe: -753.291133 hartree
dipole: -0.0431 0.6856 2.0511
dipole: 2.1630
quadrupole: -106.4727 -105.0177 -115.8753
quadrupole: -0.6902 -3.3745 -4.1400
quadrupole: 2.6492 4.1042 -6.7534 -0.6902 -3.3745 -4.1400
hfenergy: -753.6154935 hartree
pointgroup: C01 [X(C16H25N1O1)]
dipole: 0.0449451 0.1513706 0.8362286 debye
polarizability: 203.3780622|-0.202602|192.740439|3.6363623|2.8114724|141.2208769 unknown
InChI: InChI=1S/C16H25NO/c1-5-7-13-15(18)16(6-2,17(3)4)14-11-9-8-10-12-14/h8-12H,5-7,13H2,1-4H3
charge 0 multiplicity 1
43 atoms
O  -1.605889 -0.894399 -1.615662
N  0.822515 -2.094584 -0.832844
C  0.220027 -1.046814 0.040794
C  0.059445 -1.607066 1.514686
C  -1.230228 -0.631878 -0.441951
C  1.148764 0.196498 0.069161
C  -2.217915 0.009552 0.549591
C  -3.343184 0.812176 -0.137134
C  1.308772 -2.251723 2.146396
C  1.24097 -1.689528 -2.19882
C  0.123111 -3.396492 -0.866247
C  0.668479 1.524334 -0.065389
C  2.546721 0.007484 0.245465
C  -4.404884 1.318569 0.864526
C  1.549108 2.628845 0.00667
C  3.42703 1.106872 0.317624
C  -5.514157 2.148381 0.182923
C  2.931632 2.427641 0.208742
H  -0.271815 -0.772199 2.157697
H  -0.765749 -2.346153 1.518739
H  -1.678773 0.635655 1.284526
H  -2.667993 -0.819742 1.13858
H  -2.903667 1.675772 -0.677672
H  -3.816916 0.179842 -0.91054
H  1.030888 -2.752368 3.092759
H  1.759134 -3.0000 1.472303
H  2.079459 -1.498592 2.38124
H  1.750783 -0.713959 -2.170749
H  0.38963 -1.618997 -2.906327
H  1.962227 -2.43799 -2.580676
H  0.757542 -4.115926 -1.416282
H  -0.864676 -3.353673 -1.379782
H  -0.023674 -3.798941 0.149927
H  -0.391905 1.717867 -0.256206
H  2.933755 -1.01523 0.280776
H  -4.859207 0.450603 1.385323
H  -3.914704 1.930453 1.64968
H  1.152819 3.644369 -0.106647
H  4.500943 0.932691 0.450908
H  -6.042976 1.549408 -0.582004
H  -6.26368 2.501473 0.914696
H  -5.09019 3.036449 -0.322748
H  3.614129 3.283125 0.263447
