program: Gaussian 09
title: 000244890
version: EM64L-G09RevD.01
frameworkgroup: C1[X(C16H26N2)]
method: RPBEPBE
basis: SDD
operation: Freq
keyword: #pfreq=noraman
keyword: PBEPBE/SDD
title: #p freq=noraman PBEPBE/SDD
converged: NO YES NO NO
title: Mulliken charges:
elementType: N N C C C C C C C C C C C C C C C C H H H H H H H H H H H H H H H H H H H H H H H H H H
charge: -0.135386 -0.266584 0.258372 -0.478082 -0.051420 0.400067 -0.499017 -0.356158 -0.713608 -0.670605 -0.660023 -0.351469 -0.396335 -0.344748 -0.275047 -0.261410 -0.696890 -0.247208 0.210464 0.226504 0.238777 0.218629 0.188327 0.210175 0.201158 0.250350 0.231734 0.280432 0.205010 0.212349 0.228592 0.218566 0.220114 0.252338 0.225833 0.194605 0.201351 0.211606 0.225862 0.223001 0.211150 0.211993 0.218572 0.228058
chargesum: 0.00000
title: Mulliken charges with hydrogens summed into heavy atoms:
elementType: N N C C C C C C C C C C C C C C C C
charge: -0.135386 -0.054978 0.258372 -0.041114 -0.051420 0.400067 -0.041611 0.042344 -0.030365 0.027186 0.007249 -0.099131 -0.170502 0.051208 -0.049185 -0.038409 -0.055175 -0.019149
polarizability: 1.91509337e+02 1.85942004e+01 1.95468651e+02 -6.81334183e+00 -1.59022229e+00 1.70111950e+02
1716.lowfreq: -16.6040 -6.3165 -0.0006 -0.0006 0.0003 8.0015 33.4770 36.4567 51.8166
frequency: 33.2481 36.3819 51.8135 63.4060 75.7317 95.6125 105.2848 114.7411 126.6022 151.2164 162.9644 179.1121 186.8824 219.1546 231.0840 239.3518 248.0129 263.7778 315.2680 325.9512 343.5460 368.4943 371.9791 385.9555 407.8829 428.4788 466.2558 504.7203 556.1675 606.0910 617.2358 640.8770 696.9215 707.1712 724.9146 754.4223 771.3206 785.4528 844.0230 854.9364 867.0225 902.3700 908.7283 920.6899 924.1965 956.6597 974.3002 977.6055 989.6262 993.9752 998.5148 1030.9557 1036.0637 1038.5650 1061.7605 1070.7046 1081.0734 1087.8977 1097.1159 1106.6328 1112.7463 1129.7471 1140.6359 1172.5917 1177.4538 1197.3698 1205.1844 1219.7806 1245.4474 1246.8985 1260.9727 1275.8715 1283.8395 1303.1997 1319.5290 1327.6162 1336.7071 1343.9739 1375.0633 1387.4205 1391.8580 1412.0818 1432.5440 1436.4500 1452.9142 1458.1835 1461.7900 1465.6939 1472.9511 1476.6065 1478.5266 1478.8017 1482.4475 1485.7925 1487.0297 1491.6557 1498.6322 1582.2592 1605.5758 1614.3381 2877.6957 2890.8518 2960.7025 2968.0376 2973.4805 2974.2544 2988.9059 3003.6484 3004.4238 3024.6170 3026.9616 3028.0028 3048.1193 3053.0040 3070.9287 3073.9021 3079.6967 3082.2960 3098.1578 3112.5635 3116.0993 3123.1445 3136.4461 3147.5782 3162.0466 3265.5991
redmass: 2.8764 3.6739 1.7367 3.3875 2.4715 2.0233 2.9350 2.3378 2.0486 2.9775 1.8665 2.9930 1.3293 2.9641 1.3488 1.1283 1.9126 3.2200 3.6275 3.8151 3.2217 3.3022 4.1767 2.6589 2.8604 2.6776 2.4392 2.9708 3.1013 3.1013 6.3667 4.7300 5.1892 1.6571 1.0881 1.6333 1.6953 1.2335 1.9590 1.2586 1.7907 1.8659 1.8096 1.4963 1.4732 2.1980 2.3294 1.3918 5.4622 1.3854 2.0182 2.3251 2.4048 1.6520 2.6104 2.5196 1.9388 1.3100 1.3840 2.1773 2.1056 1.9375 1.4863 1.0812 3.3159 1.1403 1.4540 3.0681 1.7226 1.4959 1.2880 1.2739 1.0855 1.4288 1.3692 1.4105 1.8661 1.5579 5.6790 1.2074 1.2132 1.1382 2.1203 1.1808 1.0753 1.0489 1.0584 1.0772 1.0687 1.0861 1.3804 1.0453 1.3532 1.0482 1.0789 1.0562 1.0666 5.7989 5.9990 6.7586 1.0546 1.0549 1.0593 1.0612 1.0642 1.0366 1.0371 1.0959 1.0612 1.0803 1.0747 1.0999 1.0989 1.0989 1.1006 1.0993 1.0993 1.0983 1.0992 1.0956 1.0853 1.0865 1.0925 1.0940 1.1009 1.0748
irintensity: 0.1422 0.2196 0.0569 0.0628 0.3942 0.5202 0.6012 0.0612 0.0235 1.0572 0.0183 0.4617 0.6508 1.3995 1.2006 0.3774 1.8884 1.5019 1.1545 0.4692 8.5676 22.6994 2.0669 7.3055 0.2130 0.1136 7.8039 2.3543 15.5460 15.5128 0.0992 8.0863 3.7481 51.5470 7.4426 7.8814 40.4875 2.3045 7.9344 0.8904 11.5024 22.7871 5.9630 6.8789 3.6898 32.2612 45.2419 0.9209 2.3861 4.3519 19.8672 5.0666 3.4694 19.6377 6.5935 3.2675 5.2994 1.3699 5.9465 12.5272 25.4635 31.5947 1.1163 1.0288 16.1081 2.7043 2.8335 4.9506 5.5552 7.3546 11.7871 9.2083 1.5426 10.4281 5.7133 2.8896 36.3516 0.2837 1.8012 26.3869 12.4671 7.7767 11.9665 7.7442 1.5098 5.5635 7.3613 4.1124 2.9897 1.6398 26.2504 12.2619 3.0643 26.8930 15.3503 6.8263 10.1257 3.9657 22.4849 29.0251 46.7105 128.9601 1.4710 14.6372 59.3092 33.8774 45.8055 2.6268 22.2172 40.8913 61.7102 15.1548 31.1784 20.6870 78.6390 50.7128 12.4643 54.1808 31.1036 4.4555 6.1610 0.3321 21.0330 39.4966 24.3813 29.1103
temp: 298.150 k
press: 1.00000 atm
elementType: 7 7 6 6 6 6 6 6 6 6 6 6 6 6 6 6 6 6 1 1 1 1 1 1 1 1 1 1 1 1 1 1 1 1 1 1 1 1 1 1 1 1 1 1
symmnumber: 1
zpe: 1011480.0 jmol-1
zpe.correction: 0.385252 hartree
zpe.thermalcorrener: 0.405760 hartree
zpe.thermalcorrenthalpy: 0.406704 hartree
zpe.thermalcorrgfe: 0.336043 hartree
zpe.sumelectzpe: -733.351294 hartree
zpe.sumelectthermal: -733.330786 hartree
zpe.sumelectthermalent: -733.329842 hartree
zpe.sumelectthermalfe: -733.400504 hartree
dipole: -0.6522 1.9763 -0.9558
dipole: 2.2901
quadrupole: -106.4660 -115.8718 -107.0884
quadrupole: -0.2422 -2.9634 4.8712
quadrupole: 3.3428 -6.0631 2.7203 -0.2422 -2.9634 4.8712
hfenergy: -733.7365466 hartree
pointgroup: C01 [X(C16H26N2)]
dipole: -0.1671419 0.7829013 -0.4134197 debye
polarizability: 195.6189152|18.3540657|191.6315342|-7.0426799|-1.3201859|169.8394896 unknown
InChI: InChI=1S/C16H26N2/c1-5-7-13-15(17)16(6-2,18(3)4)14-11-9-8-10-12-14/h8-12,17H,5-7,13H2,1-4H3
charge 0 multiplicity 1
44 atoms
N  1.090435 -2.041668 0.451665
N  -1.308282 -1.342867 1.788156
C  0.288159 -0.879578 -0.067519
C  -0.327404 -1.269711 -1.461826
C  -0.94402 -0.546351 0.816429
C  1.199584 0.380185 -0.164169
C  -1.727317 0.724903 0.441548
C  -3.205924 0.453384 0.056679
C  -1.191759 -2.546871 -1.431922
C  1.614023 -1.936919 1.832005
C  2.132363 -2.54818 -0.467153
C  1.453686 1.150701 1.005647
C  1.90685 0.728222 -1.346046
C  -3.990564 1.7570 -0.213836
C  2.366375 2.225957 0.996001
C  2.823455 1.804659 -1.360566
C  -5.460401 1.49842 -0.608625
C  3.059332 2.560745 -0.190757
H  0.486517 -1.410347 -2.194657
H  -0.91926 -0.413156 -1.835766
H  -1.222439 1.267285 -0.37739
H  -1.708841 1.408312 1.316309
H  -3.710372 -0.113272 0.866438
H  -3.24227 -0.192259 -0.843747
H  -1.51678 -2.815922 -2.45424
H  -0.624236 -3.389564 -1.002587
H  -2.091733 -2.417549 -0.806447
H  0.792515 -1.683527 2.516658
H  2.441791 -1.195994 1.941167
H  2.004629 -2.928293 2.127117
H  1.697606 -2.887234 -1.422334
H  2.606277 -3.427021 0.005712
H  2.939013 -1.808653 -0.690223
H  0.924494 0.906364 1.93477
H  1.742519 0.171417 -2.274226
H  -3.955092 2.398465 0.690599
H  -3.483909 2.32737 -1.018491
H  -2.181221 -1.006447 2.253954
H  2.535846 2.802477 1.91271
H  3.350509 2.053318 -2.289121
H  -5.996797 0.953874 0.191194
H  -5.523282 0.888212 -1.529286
H  -6.000901 2.444664 -0.793631
H  3.767829 3.396452 -0.203493
