program: Gaussian 09
title: 000244885
version: EM64L-G09RevD.01
frameworkgroup: C1[X(C18H14N4O6)]
method: RPBEPBE
basis: SDD
operation: Freq
keyword: #p
keyword: freq=noraman
keyword: PBEPBE/SDD
title: #p freq=noraman PBEPBE/SDD
converged: NO YES NO NO
title: Mulliken charges:
elementType: O O O O O O N N N N C C C C C C C C C C C C C C C C C C H H H H H H H H H H H H H H
charge: -0.261422 -0.261422 -0.256227 -0.256227 -0.236009 -0.236009 0.036118 0.036119 -0.363714 -0.363714 0.221713 0.221713 0.176872 0.176873 -0.480225 -0.480225 0.502124 0.502123 -0.328747 -0.328746 -0.201732 -0.201732 -0.386232 -0.386232 -0.376680 -0.376680 0.124859 0.124859 0.303500 0.303500 0.255539 0.255539 0.242009 0.242021 0.242009 0.242021 0.232024 0.232024 0.217324 0.217324 0.336885 0.336885
chargesum: 0.00000
title: Mulliken charges with hydrogens summed into heavy atoms:
elementType: O O O O O O N N N N C C C C C C C C C C C C C C C C C C
charge: -0.261422 -0.261422 -0.256227 -0.256227 -0.236009 -0.236009 0.036118 0.036119 -0.026830 -0.026830 0.221713 0.221713 0.176872 0.176873 -0.176725 -0.176725 0.502124 0.502123 -0.073207 -0.073207 0.282298 0.282298 -0.154208 -0.154208 -0.159356 -0.159356 0.124859 0.124859
polarizability: 6.97686078e+02 2.12870832e+01 2.51222861e+02 1.06663427e-04 1.69711033e-04 1.00679178e+02
1716.lowfreq: -2.8658 -0.0012 -0.0009 0.0005 2.0922 3.9093 13.5703 16.7023 20.5976
frequency: 13.5703 16.7023 20.5976 24.5296 26.4830 44.7351 46.4181 48.5201 72.0096 108.9626 127.7924 131.3605 140.9625 200.2737 213.7606 216.9363 218.4823 218.5093 250.0679 277.4652 302.6874 314.4261 352.7946 367.3819 375.8665 376.5603 399.2924 434.7624 440.2614 473.0197 480.4306 505.7622 514.7951 557.7524 582.0323 609.1910 611.8223 612.2721 627.1851 680.8241 681.1009 723.8387 723.8634 758.1463 760.2571 765.2327 770.5740 775.5943 786.6917 791.8343 810.8999 810.9299 816.5276 838.9501 841.0336 908.7652 908.8107 918.9199 927.8205 927.9215 936.0691 954.7091 955.1042 968.1935 978.3563 983.8177 1021.5357 1062.2297 1062.2849 1064.2045 1064.2057 1079.1580 1119.3201 1119.3205 1132.4442 1138.2035 1174.8533 1187.1892 1198.1400 1200.8031 1258.4861 1259.1371 1263.7722 1264.4560 1336.3433 1345.0707 1365.4530 1365.8895 1393.8637 1396.1220 1456.3220 1456.5320 1471.5276 1475.2314 1486.7937 1486.8278 1505.0300 1512.9454 1567.2347 1571.8495 1605.6680 1605.9041 1623.1804 1623.8170 1628.6605 1638.6068 2980.2849 2980.2972 3016.6399 3016.7565 3095.2281 3095.2332 3138.7663 3138.7695 3184.1900 3184.2010 3187.5242 3187.5355 3321.0606 3321.1250
redmass: 9.7921 7.8602 3.3037 2.3139 3.0602 7.6856 12.4909 6.7612 8.6659 8.6463 8.6941 8.9963 9.6203 8.2095 6.0525 5.8883 3.7506 3.6858 10.1726 6.4032 5.4573 7.2441 7.9783 5.1549 7.3805 4.9681 6.7727 3.2211 3.3087 5.6954 6.9209 8.7581 8.4163 6.5150 6.1674 7.6291 4.1974 4.1817 7.8605 9.6652 9.6755 4.3370 4.3592 2.4537 7.2441 7.0456 1.1353 1.8102 6.0984 5.6375 1.3555 1.3551 8.0389 10.7932 10.9036 1.3631 1.3636 5.2120 1.3690 1.3679 3.7314 1.5443 1.5432 6.4094 4.6147 3.4596 7.1106 4.0237 4.0508 1.4563 1.4563 5.9099 1.0367 1.0367 1.4720 1.4494 2.2690 2.5629 1.8398 1.9125 1.9007 1.7115 1.9221 2.1903 1.7920 1.9412 1.2858 1.2945 3.8336 3.6125 4.2848 4.3869 2.5416 2.6067 1.2086 1.2253 2.2689 2.4285 5.8642 5.5967 7.5194 7.4416 7.9088 7.7784 6.6529 10.9926 1.0875 1.0875 1.0535 1.0536 1.1189 1.1189 1.0900 1.0900 1.0952 1.0951 1.0943 1.0943 1.0755 1.0747
irintensity: 0.0238 0.3341 4.0251 0.0000 28.4588 0.0000 0.0000 0.0000 5.1596 17.7049 0.0000 0.0000 3.3784 0.0000 6.0049 0.0000 0.0183 10.7189 12.2033 29.8462 0.0000 107.6441 0.0000 3.2140 50.0399 0.0000 0.0000 7.3370 0.0000 5.7631 0.0000 3.2094 0.0000 6.7426 0.0000 5.6435 0.0000 19.5185 0.0000 0.5802 0.0000 2.2115 0.0000 0.0000 38.7263 0.0000 204.6338 0.0000 1.3429 0.0000 0.0004 60.3168 163.5909 0.0000 38.3868 13.2197 0.0066 0.0000 0.0003 42.8660 5.0203 0.0004 78.7027 0.0000 358.3286 0.0000 118.4472 23.4128 0.0001 0.2230 8.3637 0.0000 0.0052 0.0147 101.1629 0.0000 151.5391 0.0000 0.0000 65.6894 468.5091 0.0001 377.0203 0.0000 99.0597 0.0000 0.0969 0.0000 180.4557 0.0000 0.0000 335.4385 602.1335 0.0000 43.9788 0.0006 0.0000 651.7665 238.2026 0.0000 2.7421 0.0001 226.5354 0.0004 575.3872 0.0000 80.4038 11.4776 299.7816 0.0052 0.7396 58.0552 0.6792 15.2921 8.6863 0.0143 14.5901 0.4802 53.9885 0.3996
temp: 298.150 k
press: 1.00000 atm
elementType: 8 8 8 8 8 8 7 7 7 7 6 6 6 6 6 6 6 6 6 6 6 6 6 6 6 6 6 6 1 1 1 1 1 1 1 1 1 1 1 1 1 1
symmnumber: 1
zpe: 786529.4 jmol-1
zpe.correction: 0.299573 hartree
zpe.thermalcorrener: 0.323939 hartree
zpe.thermalcorrenthalpy: 0.324884 hartree
zpe.thermalcorrgfe: 0.239436 hartree
zpe.sumelectzpe: -1362.588801 hartree
zpe.sumelectthermal: -1362.564435 hartree
zpe.sumelectthermalent: -1362.563490 hartree
zpe.sumelectthermalfe: -1362.648938 hartree
dipole: 0.0000 0.0000 0.0011
dipole: 0.0011
quadrupole: -92.3045 -151.0201 -162.8825
quadrupole: 6.4063 0.0005 -0.0001
quadrupole: 43.0979 -15.6177 -27.4801 6.4063 0.0005 -0.0001
hfenergy: -1362.8883739 hartree
pointgroup: C01 [X(C18H14N4O6)]
dipole: 0.0000032 -0.0004484 -0.0000014 debye
polarizability: 697.1264199|-0.3333542|100.6794104|26.5067489|-0.0978875|251.7822864 unknown
InChI: InChI=1S/C18H14N4O6/c23-17(21-19-7-11-1-3-13-15(5-11)27-9-25-13)18(24)22-20-8-12-2-4-14-16(6-12)28-10-26-14/h1-8,21-22H,9-10H2
charge 0 multiplicity 1
42 atoms
O  7.948779 -0.243066 -1.757324
O  -7.952081 -0.23651 1.755436
O  9.450087 -0.244865 0.118746
O  -9.453387 -0.234641 -0.120636
O  0.806285 -0.239049 -1.612159
O  -0.809586 -0.239971 1.610278
N  3.030203 -0.241282 0.233391
N  -3.033504 -0.237767 -0.235273
N  1.693484 -0.240697 0.592346
N  -1.696785 -0.238221 -0.594227
C  7.220084 -0.243313 -0.542453
C  -7.223385 -0.236179 0.540566
C  8.109664 -0.24437 0.560583
C  -8.112963 -0.235073 -0.562472
C  5.840632 -0.242599 -0.38489
C  -5.843932 -0.236756 0.383005
C  5.342815 -0.242987 0.960961
C  -5.346114 -0.236194 -0.962846
C  7.649537 -0.244755 1.879567
C  -7.652835 -0.234497 -1.881454
C  9.383363 -0.244341 -1.371481
C  -9.386665 -0.235853 1.369591
C  6.242775 -0.244047 2.06359
C  -6.246073 -0.235085 -2.065476
C  3.903826 -0.242293 1.223404
C  -3.907124 -0.23675 -1.225287
C  0.686382 -0.239602 -0.352042
C  -0.689683 -0.239284 0.350161
H  5.1440 -0.241768 -1.226291
H  -5.147302 -0.237595 1.224407
H  8.341376 -0.245559 2.725047
H  -8.344673 -0.233638 -2.726935
H  9.860676 -1.16442 -1.749992
H  9.862146 0.675203 -1.749412
H  -9.864938 -1.155857 1.747071
H  -9.86449 0.683766 1.74855
H  5.841579 -0.244329 3.083617
H  -5.844875 -0.234669 -3.085502
H  3.591176 -0.242654 2.287492
H  -3.594474 -0.236276 -2.289374
H  1.370842 -0.24105 1.578345
H  -1.374143 -0.237807 -1.580227
