program: Gaussian 09
title: 000020394
version: EM64L-G09RevD.01
frameworkgroup: C1[X(C10H8ClN)]
method: RPBEPBE
basis: SDD
operation: Freq
keyword: #p
keyword: freq=noraman
keyword: PBEPBE/SDD
title: #p freq=noraman PBEPBE/SDD
converged: YES YES NO NO
title: Mulliken charges:
elementType: Cl N C C C C C C C C C C H H H H H H H H
charge: -0.074379 -0.037543 0.422644 -0.084324 0.228145 -0.298370 -0.287228 -0.385783 -0.316623 -0.243140 -0.218547 -0.730938 0.245702 0.249263 0.235860 0.265037 0.232446 0.234919 0.294073 0.268786
chargesum: 0.00000
title: Mulliken charges with hydrogens summed into heavy atoms:
elementType: Cl N C C C C C C C C C C
charge: -0.074379 -0.037543 0.422644 -0.084324 0.228145 -0.052667 -0.037965 -0.149923 -0.051586 -0.010694 0.016372 -0.168079
polarizability: 1.99776857e+02 1.02500283e+01 1.17279027e+02 8.35991190e+00 -2.43812755e+00 6.23026599e+01
1716.lowfreq: -17.1984 -5.7361 -0.0014 -0.0006 0.0017 3.1491 30.4324 73.3546 162.5333
frequency: 30.3606 73.3490 162.5327 172.4081 249.8613 306.5640 395.3347 410.0335 467.3937 481.6745 516.1096 528.9345 604.9110 621.9429 696.3541 718.1631 752.7660 768.0036 801.6121 841.0298 867.5618 887.9604 921.1179 952.0706 965.5842 984.8593 998.4772 1017.1124 1110.1091 1121.1547 1149.8631 1167.6135 1228.4815 1241.4190 1253.1759 1275.9683 1300.9826 1369.3308 1405.6771 1421.9021 1439.1916 1462.3160 1504.9678 1551.9141 1594.3818 1624.2931 3067.1989 3123.2560 3131.9640 3139.4468 3157.0297 3163.8133 3164.5903 3172.3390
redmass: 6.3964 6.5640 6.7076 4.0975 2.8608 5.7769 3.4734 3.5715 4.6104 3.1091 6.9958 4.5457 5.8820 6.1641 3.6608 3.5877 5.1893 1.4191 3.1141 1.4729 3.1491 1.6997 2.5679 3.0083 1.3583 1.3824 1.3368 2.1606 1.7544 1.1704 1.1733 1.1082 1.7744 1.9195 1.2603 2.4401 2.7371 3.6863 5.2533 2.1604 1.1574 2.8938 3.6062 7.3283 6.3777 6.6040 1.0582 1.0874 1.0891 1.0893 1.0949 1.1027 1.1044 1.0995
irintensity: 1.1351 2.4334 2.8390 6.0229 4.3190 2.0357 2.3572 5.6521 2.4754 9.3814 1.2551 13.9754 18.9565 13.0908 15.8582 6.8169 7.6995 69.3291 0.1086 63.6934 6.5326 2.5433 2.9031 3.3769 2.3704 2.6818 0.0584 6.7194 12.4248 0.6047 0.3897 1.4356 5.9808 4.3824 12.9491 1.8946 6.4968 3.1006 4.9136 11.5690 10.8717 0.7088 23.6192 10.0918 12.7931 3.1406 16.7676 3.0596 6.6447 11.4618 22.4883 3.9276 9.5845 19.6954
temp: 298.150 k
press: 1.00000 atm
elementType: 17 7 6 6 6 6 6 6 6 6 6 6 1 1 1 1 1 1 1 1
symmnumber: 1
zpe: 397976.4 jmol-1
zpe.correction: 0.151581 hartree
zpe.thermalcorrener: 0.161139 hartree
zpe.thermalcorrenthalpy: 0.162083 hartree
zpe.thermalcorrgfe: 0.115120 hartree
zpe.sumelectzpe: -899.852125 hartree
zpe.sumelectthermal: -899.842568 hartree
zpe.sumelectthermalent: -899.841624 hartree
zpe.sumelectthermalfe: -899.888586 hartree
dipole: -2.8243 1.8690 1.3325
dipole: 3.6395
quadrupole: -73.0222 -69.2484 -79.3318
quadrupole: 1.4761 7.4577 -0.3135
quadrupole: 0.8452 4.6191 -5.4643 1.4761 7.4577 -0.3135
hfenergy: -900.0037065 hartree
pointgroup: C01 [X(C10H8Cl1N1)]
dipole: 1.0831408 0.7765561 -0.5234975 debye
dipolederiv: -0.6724379 -0.0467355 0.1320891 -0.0351989 -0.1757626 -0.0251255 0.4264137 0.0274499 -0.3737861 -0.3298405 0.0421085 0.0240164 0.0041027 -0.3418397 -0.0118663 0.0527121 -0.0070539 -0.2392127 -0.0080177 -0.0826958 -0.01288 0.1710296 -0.2167023 -0.0310474 0.0072103 -0.0537945 0.0732654 0.1700832 -0.0461581 0.0123965 -0.2909808 0.0481572 -0.022297 -0.0570988 -0.0076956 0.0786518 0.2596828 0.0281857 -0.0040697 0.2542009 0.2639241 0.0052381 -0.0270347 0.0147841 -0.0660501 0.1706404 0.0601035 0.0396439 -0.0576049 0.1991816 0.0365255 0.0402692 0.0640119 -0.1209496 -0.2590131 -0.1323204 -0.0212141 -0.2372132 -0.1040435 -0.0172002 -0.1248511 -0.019636 -0.1179739 -0.0418565 0.0552072 0.0208492 0.1041726 0.0960553 0.0419197 0.0325271 0.0444545 -0.1647753 -0.0911404 0.065587 0.0128495 0.0065959 0.1006294 0.044529 -0.0003582 0.0365082 -0.1448229 0.0779566 0.0927416 0.0437562 0.1115352 -0.025107 0.0259833 0.0394912 0.0269249 -0.1384641 -0.0361878 -0.1235168 0.0016987 -0.1539005 0.0795557 0.0201978 -0.0005839 0.0161003 -0.1518802 0.6897989 0.0212484 -0.2196948 0.0696703 0.149917 0.0204951 -0.3906786 -0.0163163 0.4859766 0.0635281 -0.0747722 -0.0158377 -0.0217218 -0.0729734 -0.0276345 -0.0084107 -0.0377446 0.1373863 -0.0030749 0.09479 -0.0102456 0.0909935 0.0309801 -0.0088266 -0.0002455 -0.0097979 0.1535477 0.0557255 -0.0096616 -0.0115686 -0.0843211 -0.0917805 -0.0397761 -0.0215379 -0.0351871 0.1521639 0.089725 -0.0606846 -0.0175903 -0.0048802 -0.0352037 -0.0274121 -0.0091886 -0.0322455 0.1547685 -0.11777 -0.0450547 -0.0355682 -0.0463454 0.081865 -0.0154869 -0.038308 -0.0156643 0.1550285 -0.0265962 0.1084614 -0.0044034 0.112671 -0.0148844 -0.0113719 -0.0055677 -0.0103545 0.1581283 0.0691902 0.0365077 0.0678263 -0.0605359 -0.0194064 -0.0476061 0.0527984 -0.0382634 0.0242778 -0.0603956 0.0166588 -0.0020534 0.0677311 0.0474381 0.090762 0.0324415 0.0535198 -0.0552799 unknown
polarizability: 200.1992849|-10.4453912|116.4971037|-0.181996|7.497409|62.6621551 unknown
InChI: InChI=1S/C10H8ClN/c11-7-9-6-5-8-3-1-2-4-10(8)12-9/h1-6H,7H2
charge 0 multiplicity 1
20 atoms
Cl -4.210837 -0.261873 0.999254
N  -0.796119 -0.932283 -0.360292
C  0.90709 0.831156 0.063603
C  0.524866 -0.548942 -0.162331
C  -1.74767 0.025438 -0.344141
C  -0.138017 1.813389 0.07651
C  -1.458051 1.417174 -0.123931
C  2.288091 1.150936 0.26145
C  1.536508 -1.561136 -0.181741
C  3.2561 0.143165 0.237502
C  2.877383 -1.219903 0.01505
C  -3.157997 -0.439609 -0.584224
H  0.112953 2.866953 0.245944
H  -2.279033 2.140233 -0.107488
H  2.575835 2.195323 0.43275
H  1.220252 -2.594701 -0.352242
H  4.312074 0.391508 0.389848
H  3.648432 -1.997841 0.000547
H  -3.176783 -1.507446 -0.835463
H  -3.696877 0.168059 -1.326007
