program: Gaussian 09
title: 000244867
version: EM64L-G09RevD.01
frameworkgroup: C1[X(C6H6N2O3)]
method: RPBEPBE
basis: SDD
operation: Freq
keyword: #pfreq=noraman
keyword: PBEPBE/SDD
title: #p freq=noraman PBEPBE/SDD
converged: NO NO NO NO
title: Mulliken charges:
elementType: O O O N N C C C C C C H H H H H H
charge: -0.222882 -0.222882 -0.221777 -0.382232 -0.382231 -0.038113 -0.476639 -0.476594 0.182479 0.182479 0.174891 0.285204 0.285205 0.285203 0.285205 0.371343 0.371343
chargesum: 0.00000
title: Mulliken charges with hydrogens summed into heavy atoms:
elementType: O O O N N C C C C C C
charge: -0.222882 -0.222882 -0.221777 -0.010890 -0.010888 -0.038113 0.093770 0.093814 0.182479 0.182479 0.174891
polarizability: 1.15731435e+02 -7.75161674e-07 8.88204197e+01 -4.37059568e-04 2.63551530e-04 4.96777455e+01
1716.lowfreq: -3.9121 0.0001 0.0005 0.0011 10.1251 12.1167 59.0530 147.0123 162.7183
frequency: 59.0528 147.0076 162.7137 247.4021 252.1782 279.9178 340.1892 360.6182 407.2074 489.0907 586.6792 627.3887 652.8700 669.5104 700.2146 704.4177 751.9545 777.7729 800.7626 819.9716 881.5545 970.7346 987.6771 997.2283 1076.5585 1103.9054 1139.2020 1191.0135 1231.7393 1275.9142 1356.8927 1371.5322 1379.1466 1380.2235 1412.2714 1437.5317 1625.0213 1647.9892 1675.5728 3108.4374 3112.0894 3219.7863 3236.9621 3525.9734 3527.6843
redmass: 6.2412 5.9595 12.3361 2.0903 3.9540 4.7796 8.1441 12.9503 11.6201 9.5236 10.1528 4.5038 2.1598 2.4972 6.3501 6.6447 1.9156 1.7159 1.0335 9.4094 1.6472 6.4899 1.1632 3.5104 1.1448 1.3324 3.4560 1.3151 3.6837 5.4607 2.2202 1.7135 3.6453 4.6860 1.0879 1.3529 6.9343 8.4120 5.3452 1.0493 1.0612 1.1193 1.1174 1.0759 1.0784
irintensity: 2.9656 0.0000 10.7573 0.0000 2.3361 0.3368 39.0057 26.4756 6.5992 24.4509 1.7819 0.9526 0.0000 25.7862 6.5793 0.0028 0.0000 215.1800 2.2311 34.3663 0.2883 37.0700 0.0000 10.2636 2.4672 9.9508 4.5354 0.0000 78.1218 123.6761 276.7586 8.9664 184.3288 162.6994 17.9871 0.5466 438.5331 38.2975 618.3922 4.4672 0.4436 0.0000 0.0005 97.6291 45.1385
temp: 298.150 k
press: 1.00000 atm
elementType: 8 8 8 7 7 6 6 6 6 6 6 1 1 1 1 1 1
symmnumber: 1
zpe: 321254.5 jmol-1
zpe.correction: 0.122359 hartree
zpe.thermalcorrener: 0.131426 hartree
zpe.thermalcorrenthalpy: 0.132370 hartree
zpe.thermalcorrgfe: 0.087931 hartree
zpe.sumelectzpe: -566.639132 hartree
zpe.sumelectthermal: -566.630066 hartree
zpe.sumelectthermalent: -566.629121 hartree
zpe.sumelectthermalfe: -566.673561 hartree
dipole: 1.3083 0.0000 0.0008
dipole: 1.3083
quadrupole: -69.1641 -72.1727 -60.5520
quadrupole: 0.0000 0.0025 -0.0002
quadrupole: -1.8678 -4.8764 6.7443 0.0000 0.0025 -0.0002
hfenergy: -566.7614917 hartree
pointgroup: C01 [X(C6H6N2O3)]
dipole: -0.5147359 -0.0000072 0.0004848 debye
dipolederiv: -0.6521173 -0.1961632 0.0000686 -0.2142458 -1.0229374 -0.0000082 0.0001186 0.0001201 -0.3507405 -0.6521315 0.1961764 0.0000423 0.2142584 -1.0229216 0.0001148 0.0000212 0.0000876 -0.3507404 -1.3550145 -0.0000146 0.0002731 -0.0000138 -0.5831232 0.0000212 0.0002629 0.0000167 -0.3721127 -1.3245153 -0.5940418 0.0003594 -0.363123 -0.7782208 0.000131 0.000269 0.0001712 -0.3327086 -1.3245508 0.5940225 0.0002199 0.3631037 -0.7781866 -0.0000458 0.0002193 -0.0001009 -0.3327077 -1.0446544 -0.0000096 0.000617 -0.0000092 -0.4937837 0.0000659 0.0006931 0.0000363 0.0102186 0.3446144 0.0000045 -0.0631956 0.0000321 0.0193991 -0.0000013 0.2864976 -0.0000005 -0.0211855 0.3441639 0.0000076 0.0627007 -0.0000202 0.0194003 0.0000012 -0.2869859 -0.0000111 -0.020917 1.5656629 0.298046 -0.000397 -0.1565996 1.2005703 0.0002046 -0.0003908 -0.0000435 0.2425645 1.5656679 -0.2980326 -0.0003511 0.1566131 1.2005642 -0.0003842 -0.0003676 -0.0001764 0.2425645 1.9385506 0.0000042 -0.0004485 0.000004 1.7107715 -0.0001354 -0.0003926 -0.0001395 0.3446192 0.0688523 0.0169435 0.0306192 0.0213633 0.0242296 -0.065516 0.0249692 -0.0278037 0.0609385 0.068857 -0.0169346 0.0306208 -0.0213612 0.0242471 0.0655219 0.0249718 0.0278075 0.0609236 0.0688245 -0.0169605 -0.0306114 -0.0214605 0.0242501 -0.0654934 -0.0249845 -0.0277833 0.061021 0.0688265 0.0169544 -0.0306176 0.021461 0.0242709 0.0654969 -0.0249891 0.0277857 0.061006 0.1594837 -0.0441433 0.0000519 -0.0586297 0.2157333 0.0000248 0.0000476 0.0000132 0.3486283 0.15948 0.044141 0.0000483 0.0586275 0.2157369 0.0000021 0.0000402 0.0000207 0.3486282 unknown
polarizability: 115.7314268|0.0004797|88.8204192|-0.022587|-0.004703|49.6777538 unknown
InChI: InChI=1S/C6H6N2O3/c9-3-6(1-2-6)4(10)8-5(11)7-3/h7-8H,1-2H2
charge 0 multiplicity 1
17 atoms
O  -0.774749 -2.427133 0.000502
O  -0.774838 2.427143 -0.000075
O  3.20475 0.000077 -0.000736
N  1.18673 -1.183107 -0.000087
N  1.186687 1.183188 -0.000342
C  -0.967923 0.000001 0.000471
C  -2.344037 0.000039 0.750942
C  -2.344871 -0.000085 -0.748297
C  -0.21832 -1.295568 0.00022
C  -0.218367 1.295598 0.000018
C  1.948636 0.000055 -0.000401
H  -2.579845 0.933387 1.268721
H  -2.579812 -0.933234 1.268872
H  -2.58126 -0.933448 -1.265783
H  -2.581293 0.933184 -1.265937
H  1.722844 -2.056844 -0.000156
H  1.722769 2.056945 -0.000629
