program: Gaussian 09
title: 000244866
version: EM64L-G09RevD.01
frameworkgroup: C1[X(C5H4ClF3N4)]
method: RPBEPBE
basis: SDD
operation: Freq
keyword: #p
keyword: freq=noraman
keyword: PBEPBE/SDD
title: #p freq=noraman PBEPBE/SDD
converged: NO NO NO NO
title: Mulliken charges:
elementType: Cl F F F N N N N C C C C C H H H H
charge: -0.006684 -0.139115 -0.151817 -0.152323 -0.022534 0.084014 -0.653684 -0.602196 0.173171 -0.109694 0.186889 -0.279293 0.338600 0.316541 0.316555 0.341409 0.360161
chargesum: 0.00000
title: Mulliken charges with hydrogens summed into heavy atoms:
elementType: Cl F F F N N N N C C C C C
charge: -0.006684 -0.139115 -0.151817 -0.152323 -0.022534 0.084014 -0.020588 0.099374 0.173171 -0.109694 0.186889 -0.279293 0.338600
polarizability: 1.14464006e+02 -3.71444415e+00 1.17919427e+02 1.03185811e-02 5.21998861e-04 4.75989999e+01
1716.lowfreq: -278.2572 -0.0019 0.0011 0.0015 3.2721 5.5424 5.7463 11.2652 81.7299
frequency: -278.2568 11.2016 81.7252 120.7666 134.9363 207.9737 218.1497 261.6943 281.9678 301.5220 312.6750 358.2796 389.9868 471.5115 471.9154 533.5391 551.0345 582.4320 605.8322 619.1743 674.7983 679.3144 703.6034 721.1592 786.2278 807.5263 937.9378 993.1110 1008.8570 1056.4714 1116.7058 1159.9317 1219.2445 1281.3929 1324.0907 1410.2214 1446.8401 1509.0485 1536.0130 1600.2696 1639.3179 3446.5977 3506.1763 3556.6225 3677.8463
redmass: 1.0363 15.3896 6.7416 8.8951 16.1882 10.2926 7.0427 6.4863 5.0991 13.8491 4.8418 6.1871 13.0893 13.0753 8.0398 9.0286 1.2280 4.6907 6.6135 11.3842 1.0968 1.9255 9.2059 3.3962 9.0679 11.2629 9.5612 2.6021 12.9723 10.1505 5.9406 1.3050 4.3068 9.3529 9.3407 10.3254 5.8391 2.0616 7.5767 2.1160 1.1835 1.0451 1.0453 1.0969 1.1041
irintensity: 22.6477 0.1266 0.7446 0.0866 0.2162 0.2905 1.1918 8.7865 12.0362 3.1487 3.6149 4.1027 9.1951 0.2974 1.5469 7.4351 184.7724 10.0870 11.5905 47.6423 105.0444 118.7428 7.8659 74.2918 19.1741 89.9504 120.3234 53.2110 242.6515 161.5901 107.7414 1.4188 33.5888 293.1944 0.2959 3.5765 132.4028 81.9498 17.2276 468.5159 131.0006 16.3751 123.0688 19.6984 81.6677
temp: 298.150 k
press: 1.00000 atm
elementType: 17 9 9 9 7 7 7 7 6 6 6 6 6 1 1 1 1
symmnumber: 1
zpe: 265066.4 jmol-1
zpe.correction: 0.100958 hartree
zpe.thermalcorrener: 0.112570 hartree
zpe.thermalcorrenthalpy: 0.113514 hartree
zpe.thermalcorrgfe: 0.061315 hartree
zpe.sumelectzpe: -1170.569176 hartree
zpe.sumelectthermal: -1170.557565 hartree
zpe.sumelectthermalent: -1170.556621 hartree
zpe.sumelectthermalfe: -1170.608820 hartree
dipole: 6.4956 4.2580 -0.0014
dipole: 7.7668
quadrupole: -76.0924 -75.6786 -79.7379
quadrupole: 4.8666 0.0137 0.0045
quadrupole: 1.0772 1.4910 -2.5682 4.8666 0.0137 0.0045
hfenergy: -1170.6701346 hartree
pointgroup: C01 [X(C5H4Cl1F3N4)]
dipole: -2.7728394 1.2839152 -0.0129678 debye
dipolederiv: -0.3410607 -0.3900352 0.0175471 -0.3661657 -0.7046252 0.0275605 0.0165157 0.027639 -0.0767345 -0.5650964 -0.2496827 0.0098677 -0.1991211 -0.6535164 0.0115482 0.0092295 0.012493 -0.2762212 -0.5950413 0.1058392 -0.1841759 0.1242777 -0.367429 0.2008062 -0.1555015 0.1790203 -0.6389497 -0.5888093 0.1104547 0.177031 0.1271463 -0.388713 -0.2178341 0.1491849 -0.1959981 -0.627609 -0.6264882 0.5285938 -0.014366 -0.0176531 -0.7147442 0.0188365 0.0058318 0.012917 -0.2022442 -1.2330571 -0.4047554 0.0283874 -0.1709532 -0.6810651 0.0231792 0.0198606 0.0253955 -0.1145578 -0.7703721 0.1050669 0.0028787 0.1145039 -0.5266059 0.0110202 0.0023778 0.0111692 -0.1925361 -0.4286514 0.4849846 -0.020421 0.4664602 -1.2973721 0.0181287 -0.0198087 0.0179153 -0.6545019 0.5459616 -0.3181419 0.0055151 0.2010437 -0.7952101 0.0268889 -0.0136435 0.0329429 -0.0028183 0.4666599 -0.0262313 -0.0056592 0.1745826 0.7659394 -0.0322898 -0.0154403 -0.0297778 -0.0564154 0.4514661 -0.4792763 0.0148383 -0.6564179 1.5509138 -0.0415588 0.0216534 -0.0437881 0.2138081 1.0311367 0.5882009 -0.0337386 0.4382674 1.3342624 -0.0535915 -0.0278913 -0.0552112 0.0261906 1.8671124 0.0301556 -0.0041036 0.0063753 1.3809193 0.00558 -0.0045261 0.0052563 1.5365408 0.1699759 -0.0214638 0.0121363 -0.1039163 0.2549315 -0.1189073 0.0274629 -0.056598 0.1635318 0.1692093 -0.0211294 -0.010806 -0.1030838 0.2675521 0.1136358 -0.0200661 0.049447 0.1518827 0.164624 0.0203618 0.0018191 -0.0312253 0.312282 0.0031428 0.0037304 0.0025972 0.386102 0.2824307 -0.0629415 0.0032497 -0.0041207 0.2624805 0.0038546 0.0010305 0.0045805 0.3645322 unknown
polarizability: 113.4537638|3.0243463|118.8208612|-0.9029761|-2.6595664|47.7078082 unknown
InChI: InChI=1S/C5H4ClF3N4/c6-2-1(10)3(11)13-4(12-2)5(7,8)9/h10-11H2
charge 0 multiplicity 1
17 atoms
Cl -2.130989 -2.666125 0.153376
F  2.90203 1.224299 -0.037611
F  2.771019 -0.699948 1.149591
F  2.742253 -0.758576 -1.120644
N  0.201425 1.279831 -0.019222
N  0.120383 -1.150335 0.070979
N  -3.398852 0.242358 0.060792
N  -1.799417 2.525372 -0.041946
C  -1.970081 0.109459 0.049268
C  0.756948 0.051048 0.01947
C  -1.176387 1.315413 -0.00446
C  -1.226049 -1.085615 0.084681
C  2.280273 -0.033168 0.0027
H  -3.866788 -0.141361 -0.768191
H  -3.847496 -0.078823 0.926232
H  -1.245926 3.378321 -0.080089
H  -2.820845 2.525849 -0.030224
