program: Gaussian 09
title: 000244865
version: EM64L-G09RevD.01
frameworkgroup: C1[X(C5H2Cl2F3N3)]
method: RPBEPBE
basis: SDD
operation: Freq
keyword: #p
keyword: freq=noraman
keyword: PBEPBE/SDD
title: #p freq=noraman PBEPBE/SDD
converged: NO YES NO NO
title: Mulliken charges:
elementType: Cl Cl F F F N N N C C C C C H H
charge: 0.006155 0.007015 -0.133696 -0.152042 -0.151844 0.107395 0.127454 -0.615457 -0.134117 0.547207 0.339468 -0.314413 -0.309033 0.337935 0.337975
chargesum: 0.00000
title: Mulliken charges with hydrogens summed into heavy atoms:
elementType: Cl Cl F F F N N N C C C C C
charge: 0.006155 0.007015 -0.133696 -0.152042 -0.151844 0.107395 0.127454 0.060452 -0.134117 0.547207 0.339468 -0.314413 -0.309033
polarizability: 1.29557100e+02 -4.99311718e-01 1.23431661e+02 2.31748906e-02 9.75296056e-04 4.28634515e+01
1716.lowfreq: -5.9936 -5.7131 -0.0018 -0.0015 -0.0008 6.2537 15.6819 74.8641 98.3034
frequency: 15.1895 74.8605 98.3030 125.7947 185.9776 210.8118 258.3621 265.8754 293.6551 303.7112 356.2195 386.9499 406.7121 476.8973 491.3495 500.3402 549.6031 554.2611 574.9725 608.6721 670.8872 727.7210 737.1433 783.8031 799.7166 1001.4103 1044.6263 1062.5715 1085.6474 1100.8314 1277.9341 1343.6077 1368.7110 1445.1276 1464.3265 1559.7472 1629.2508 3519.4734 3663.7373
redmass: 19.7027 6.5221 18.0815 20.2558 25.9488 14.1278 10.8059 7.3548 11.9754 8.4703 14.5409 10.0392 16.3118 7.9987 10.6412 1.0616 7.9439 1.2792 7.4622 13.5061 12.4065 10.9255 9.2047 12.5526 12.0495 13.0230 6.6213 1.9467 11.3939 10.2348 6.4133 12.5098 11.2923 7.5621 8.8240 2.4708 1.7934 1.0452 1.1048
irintensity: 0.0369 3.9380 0.2498 0.0622 0.3350 0.0538 2.9900 0.9932 2.3861 4.3443 3.8312 3.4440 9.7523 0.0591 0.5816 0.2111 0.6614 279.1213 1.0184 54.5643 11.1379 14.6375 93.4453 0.0601 63.7088 249.7030 72.6453 241.4764 108.3886 123.1187 36.7448 15.9684 277.5921 170.0432 95.6500 3.4329 245.7783 127.6301 57.6846
temp: 298.150 k
press: 1.00000 atm
elementType: 17 17 9 9 9 7 7 7 6 6 6 6 6 1 1
symmnumber: 1
zpe: 197532.1 jmol-1
zpe.correction: 0.075236 hartree
zpe.thermalcorrener: 0.087163 hartree
zpe.thermalcorrenthalpy: 0.088107 hartree
zpe.thermalcorrgfe: 0.034963 hartree
zpe.sumelectzpe: -1574.679623 hartree
zpe.sumelectthermal: -1574.667697 hartree
zpe.sumelectthermalent: -1574.666752 hartree
zpe.sumelectthermalfe: -1574.719896 hartree
dipole: 7.1538 0.0092 0.0044
dipole: 7.1538
quadrupole: -78.4220 -93.5958 -87.5365
quadrupole: 0.8115 0.0345 0.0000
quadrupole: 8.0961 -7.0777 -1.0184 0.8115 0.0345 0.0000
hfenergy: -1574.7548593 hartree
pointgroup: C01 [X(C5H2Cl2F3N3)]
dipole: -2.814249 0.0394028 0.0039058 debye
dipolederiv: -0.2874755 0.3650548 0.0007435 0.31037 -0.7131531 -0.0010208 0.00116 -0.0024035 -0.0520332 -0.2791552 -0.3566077 0.0004454 -0.3063715 -0.7200108 0.0004956 0.0009187 0.0019542 -0.0527086 -0.5564319 -0.2354306 0.0006292 -0.2057083 -0.6708877 0.0010199 0.0001807 0.0008824 -0.2721938 -0.6737356 0.1099055 -0.1851505 0.1760463 -0.3741672 0.2029895 -0.2049146 0.1859155 -0.6350763 -0.6729116 0.1105326 0.1850042 0.1767991 -0.3755591 -0.2040097 0.2038518 -0.1866936 -0.6335486 -0.4352989 0.143258 0.0014042 -0.107357 -0.3711015 -0.0001533 0.0001341 -0.0008103 -0.0826115 -0.5009817 -0.1527969 0.0014196 0.0706568 -0.3720181 -0.0000256 0.0001089 0.0006023 -0.0667189 -1.5011001 -0.0111901 0.0000526 -0.0104547 -0.1159598 0.0002517 -0.0012865 0.0002379 -0.6191887 0.0226219 0.002747 -0.0002687 -0.0514301 0.1671966 0.0000801 -0.0001481 0.0000117 -0.1087171 1.3645712 0.0169488 -0.0009864 0.0308627 -0.8621352 -0.0005052 -0.001755 -0.0005187 0.2481404 2.20742 0.0232744 -0.0005977 -0.0597745 1.3740709 -0.000042 0.0006076 -0.0000588 1.5589419 0.3401228 -0.335844 -0.0017481 -0.816103 1.3175874 0.0023994 -0.0009435 0.0034932 -0.0177829 0.3577317 0.3190254 -0.0015759 0.7910203 1.3364883 -0.0013051 -0.0002545 -0.0024512 -0.0138836 0.3068038 0.0204335 0.000326 0.0579988 0.1907496 0.0000192 0.0012009 0.0003822 0.3735222 0.3078191 -0.0193109 0.0003026 -0.056555 0.1888998 -0.0001936 0.0011397 -0.0005435 0.3738588 unknown
polarizability: 129.540312|-0.5926953|123.4483485|-0.0902855|0.0325228|42.863552 unknown
InChI: InChI=1S/C5H2Cl2F3N3/c6-2-1(11)3(7)13-4(12-2)5(8,9)10/h11H2
charge 0 multiplicity 1
15 atoms
Cl -2.082511 2.792306 0.004178
Cl -2.044285 -2.786111 0.001894
F  2.855404 1.285859 -0.003959
F  2.802863 -0.6751 1.133928
F  2.802617 -0.679612 -1.133912
N  0.139421 1.221933 -0.000767
N  0.153773 -1.183533 -0.001808
N  -3.347892 -0.005862 0.002091
C  0.780203 0.024837 -0.000948
C  -1.982185 0.004441 0.000118
C  2.294726 0.002148 -0.001394
C  -1.189929 1.200832 -0.000661
C  -1.17321 -1.183046 -0.001785
H  -3.849882 -0.892772 0.004326
H  -3.862812 0.873582 0.005197
