program: Gaussian 09
title: 000244854
version: EM64L-G09RevD.01
frameworkgroup: C1[X(C11H16N2O)]
method: RPBEPBE
basis: SDD
operation: Freq
keyword: #p
keyword: freq=noraman
keyword: PBEPBE/SDD
title: #p freq=noraman PBEPBE/SDD
converged: YES YES NO NO
title: Mulliken charges:
elementType: O N N C C C C C C C C C C C H H H H H H H H H H H H H H H H
charge: -0.244518 -0.392110 -0.369377 -0.035199 -0.512693 -0.704762 -0.701265 0.222028 0.455693 -0.417716 -0.340525 -0.197755 -0.211323 -0.265580 0.244505 0.232832 0.197159 0.244768 0.217480 0.192632 0.203163 0.214717 0.220065 0.314830 0.306771 0.221823 0.233991 0.222647 0.221291 0.226427
chargesum: 0.00000
title: Mulliken charges with hydrogens summed into heavy atoms:
elementType: O N N C C C C C C C C C C C
charge: -0.244518 -0.077280 -0.062606 0.209306 -0.082703 -0.049881 -0.063319 0.222028 0.455693 -0.195893 -0.106534 0.024892 0.009967 -0.039153
polarizability: 1.79705197e+02 -7.75475887e+00 1.32267176e+02 -1.40823844e+01 -4.62229038e+00 9.39927297e+01
1716.lowfreq: -3.5859 -0.0006 -0.0002 0.0006 4.3784 11.1625 27.0272 36.9375 42.3953
frequency: 26.7741 36.8897 42.3441 49.3284 88.7398 150.6860 192.5487 214.4339 232.2388 245.7570 271.8258 283.1956 350.4098 379.6463 406.3578 413.7397 441.4927 474.0712 514.8062 527.9396 599.2669 613.5334 661.7576 693.0090 729.4677 756.8342 821.6660 822.7056 831.0803 880.0907 885.5054 920.1127 923.8046 959.0760 961.1397 966.4789 979.2399 981.7864 1021.7667 1063.8410 1086.2438 1125.4532 1152.9102 1169.8136 1176.3557 1180.9066 1204.7119 1244.2607 1282.5001 1304.5399 1313.6363 1336.3962 1340.5550 1378.1270 1384.0342 1395.1624 1430.4590 1442.5181 1448.7465 1466.8370 1473.0400 1482.5265 1484.9498 1488.9575 1498.0294 1600.1138 1615.5001 1630.3981 2965.8978 2968.3342 2971.7330 3001.8453 3036.2700 3057.2617 3067.5544 3071.5327 3075.9416 3118.0976 3127.6606 3141.1656 3154.2931 3168.2813 3497.8843 3522.7577
redmass: 3.7334 3.2272 3.6446 5.4003 3.3049 4.0879 4.4775 1.0749 2.3400 1.1877 3.2332 3.0624 2.6106 2.4278 2.8912 2.1854 2.0718 3.2473 2.6889 1.6047 2.5096 6.2997 4.4487 1.9543 4.4870 1.7529 1.8295 2.0123 2.7711 1.5450 1.4847 1.4885 2.1679 1.3682 1.5362 2.2839 1.3027 5.8662 2.1659 1.8105 1.5013 2.2618 2.8166 1.0523 1.8592 1.1112 1.9208 1.5527 1.5713 2.3011 1.4351 1.5297 1.4260 1.2138 4.5655 1.2161 2.0388 1.5945 1.1882 1.0523 1.0522 1.0631 2.4204 1.0485 1.4506 5.3971 6.4121 6.4905 1.0361 1.0426 1.0548 1.0828 1.1005 1.0989 1.0982 1.0998 1.0989 1.0866 1.0864 1.0928 1.0942 1.1010 1.0764 1.0788
irintensity: 0.2062 0.9735 0.2882 4.1921 3.3552 5.4033 2.6633 0.8603 11.0219 2.3267 0.6259 4.6262 1.7330 2.6956 0.3116 1.3931 55.5255 22.3085 58.1242 76.6242 66.1749 1.7601 18.5059 38.1281 0.6518 86.1214 3.5734 1.0047 9.1193 2.3511 9.9538 5.9430 5.8361 0.2537 0.2478 2.9190 0.6378 0.5946 5.6673 22.1923 9.6169 16.2703 21.2342 1.4061 34.1534 10.0922 40.0931 27.7823 26.7113 4.7948 4.4003 8.1230 15.2175 15.5093 22.3064 9.2574 37.5526 76.8960 26.8773 4.7233 6.8264 10.3550 89.1372 23.6321 27.8244 16.6878 145.5738 100.1600 35.7973 17.9953 32.2276 2.4393 13.5905 12.2845 78.2528 20.1990 67.1525 10.3685 1.0816 24.8010 37.4542 14.6219 18.0185 32.7575
temp: 298.150 k
press: 1.00000 atm
elementType: 8 7 7 6 6 6 6 6 6 6 6 6 6 6 1 1 1 1 1 1 1 1 1 1 1 1 1 1 1 1
symmnumber: 1
zpe: 660934.3 jmol-1
zpe.correction: 0.251737 hartree
zpe.thermalcorrener: 0.266379 hartree
zpe.thermalcorrenthalpy: 0.267323 hartree
zpe.thermalcorrgfe: 0.208405 hartree
zpe.sumelectzpe: -612.423178 hartree
zpe.sumelectthermal: -612.408536 hartree
zpe.sumelectthermalent: -612.407592 hartree
zpe.sumelectthermalfe: -612.466510 hartree
dipole: 1.3107 0.0614 -2.7855
dipole: 3.0790
quadrupole: -77.5257 -79.0622 -89.0293
quadrupole: 1.8019 -6.9857 2.2823
quadrupole: 4.3467 2.8102 -7.1569 1.8019 -6.9857 2.2823
hfenergy: -612.6749149 hartree
pointgroup: C01 [X(C11H16N2O1)]
dipole: -0.4724121 0.0825976 1.1124161 debye
polarizability: 178.3500905|7.2860612|132.7352046|-17.8641662|2.101226|94.8798079 unknown
InChI: InChI=1S/C11H16N2O/c1-9(2)8-11(14)13-12-10-6-4-3-5-7-10/h3-7,9,12-13H,8H2,1-2H3
charge 0 multiplicity 1
30 atoms
O  -1.324527 -1.421773 -1.132501
N  -0.480083 -1.082886 1.006911
N  0.822562 -1.483845 0.673886
C  -3.540768 0.449243 -0.228919
C  -2.882691 -0.671966 0.625182
C  -2.722634 1.75982 -0.160695
C  -5.001259 0.676612 0.221732
C  -1.51882 -1.080944 0.069849
C  1.779929 -0.504702 0.281282
C  3.006383 -0.948195 -0.28416
C  1.570774 0.88148 0.498932
C  4.002828 -0.013601 -0.629018
C  2.580087 1.806018 0.151996
C  3.801092 1.370912 -0.411634
H  -3.539263 0.092204 -1.277504
H  -3.534474 -1.567478 0.606295
H  -2.805356 -0.341509 1.68117
H  -1.690989 1.61322 -0.529418
H  -3.191348 2.544191 -0.782591
H  -2.672262 2.140009 0.878952
H  -5.044098 1.01777 1.274487
H  -5.599311 -0.250279 0.139072
H  -5.487118 1.450174 -0.400747
H  -0.665635 -0.910744 1.997438
H  0.84652 -2.368947 0.157395
H  3.174071 -2.019416 -0.451633
H  0.622738 1.230143 0.920795
H  4.94144 -0.368537 -1.069746
H  2.405657 2.875159 0.31983
H  4.578452 2.093669 -0.680041
