program: Gaussian 09
title: 000020392
version: EM64L-G09RevD.01
frameworkgroup: C1[X(C9H8O4)]
method: RPBEPBE
basis: SDD
operation: Freq
keyword: #p
keyword: freq=noraman
keyword: PBEPBE/SDD
title: #p freq=noraman PBEPBE/SDD
converged: YES YES NO NO
title: Mulliken charges:
elementType: O O O O C C C C C C C C C H H H H H H H H
charge: -0.261267 -0.434153 -0.234500 -0.238151 0.233737 0.156109 -0.366806 -0.320299 -0.215967 -0.217133 0.150482 0.114025 -0.502356 0.266484 0.275790 0.240186 0.239481 0.245435 0.253275 0.230639 0.384989
chargesum: 0.00000
title: Mulliken charges with hydrogens summed into heavy atoms:
elementType: O O O O C C C C C C C C C
charge: -0.261267 -0.049165 -0.234500 -0.238151 0.233737 0.156109 -0.100321 -0.044509 0.024219 0.022348 0.150482 0.114025 0.226993
polarizability: 1.42302002e+02 7.84962434e+00 1.24002338e+02 8.07741876e+00 -4.75180910e+00 5.90680754e+01
1716.lowfreq: -4.9223 -0.0009 -0.0008 0.0005 6.5065 8.8442 33.0401 66.2841 80.8706
frequency: 32.9768 66.2755 80.8669 96.2774 110.4285 147.2424 208.8698 251.0999 273.9796 312.0938 353.4113 393.1131 407.1516 516.6459 541.2722 590.3034 597.5484 649.9410 676.7197 705.9885 735.3194 775.7662 791.2913 796.2131 900.4418 919.2062 977.1555 1001.7178 1005.7534 1035.6724 1073.0261 1108.5171 1117.9920 1152.1539 1162.8767 1178.3385 1242.8119 1281.2805 1315.3896 1382.9672 1417.3372 1431.1641 1452.1157 1465.7999 1478.6844 1580.3060 1603.9952 1627.6089 1644.8928 3005.7193 3110.8649 3139.8494 3150.2189 3154.4852 3168.7651 3181.9192 3528.9180
redmass: 8.0840 1.5475 6.1311 2.0029 3.8655 5.4060 6.7334 4.8684 4.9981 5.6241 7.7247 6.5545 3.2330 4.6220 4.8561 1.3193 4.2790 5.9223 4.8872 3.7890 5.3715 3.0966 1.8967 4.7695 1.6344 4.7424 1.4198 4.3168 1.4348 2.9961 3.4414 1.5533 1.4788 1.4752 1.7506 1.0689 2.9205 1.6326 2.5654 10.9524 1.2124 2.1651 1.0516 1.0511 2.6811 7.1968 6.3185 10.4570 8.9360 1.0290 1.1049 1.0864 1.1049 1.0913 1.0967 1.0978 1.0641
irintensity: 0.4668 2.2643 3.4673 0.9525 2.5113 3.0559 0.5102 2.4841 6.7932 6.9156 6.5639 11.6296 5.8297 11.8062 10.4202 88.6145 43.2039 9.9732 7.5120 103.2991 7.3002 29.1573 29.7344 0.4753 2.8567 6.8150 11.4858 207.8411 14.8250 42.8222 139.5405 29.1188 21.6335 29.3133 67.3677 0.1316 155.4209 48.1911 81.2862 8.0944 26.9898 11.4708 14.2144 10.7276 18.1110 26.1250 17.4438 183.6225 224.1135 32.4080 18.3948 2.0729 14.9424 8.3068 11.0474 9.3601 42.4859
temp: 298.150 k
press: 1.00000 atm
elementType: 8 8 8 8 6 6 6 6 6 6 6 6 6 1 1 1 1 1 1 1 1
symmnumber: 1
zpe: 401399.4 jmol-1
zpe.correction: 0.152885 hartree
zpe.thermalcorrener: 0.165050 hartree
zpe.thermalcorrenthalpy: 0.165994 hartree
zpe.thermalcorrgfe: 0.113320 hartree
zpe.sumelectzpe: -647.718981 hartree
zpe.sumelectthermal: -647.706816 hartree
zpe.sumelectthermalent: -647.705872 hartree
zpe.sumelectthermalfe: -647.758546 hartree
dipole: -1.9079 0.9243 -1.9469
dipole: 2.8784
quadrupole: -60.7755 -65.2287 -81.0712
quadrupole: 4.7433 -5.8172 3.0073
quadrupole: 8.2496 3.7965 -12.0461 4.7433 -5.8172 3.0073
hfenergy: -647.8718661 hartree
pointgroup: C01 [X(C9H8O4)]
dipole: -0.7825212 -0.214464 0.7899817 debye
dipolederiv: -1.0884103 0.1208559 -0.3302043 0.1790668 -0.4135138 0.2380156 -0.5689463 0.2266293 -0.7762352 -0.4448179 -0.3485398 0.1141776 -0.3267856 -1.02739 0.35685 0.0988685 0.4035208 -0.5775802 -0.7358691 -0.2066375 0.2114918 -0.0795399 -0.4918477 0.2912393 -0.0827459 0.2183878 -0.7041488 -0.8497999 0.1180854 0.2761278 0.1915482 -0.7162907 -0.0456957 0.2337852 0.0435683 -0.4681103 -0.2771126 0.0454916 0.0029144 -0.0728651 0.1208792 0.0341477 0.1002432 -0.0359203 -0.0432039 -0.0773657 0.2421504 0.0240988 0.2524215 -0.4281369 0.0511471 -0.0873895 0.0250268 -0.0054672 -0.1692483 0.1550148 -0.0219144 0.0501792 0.014179 -0.0329666 0.0305305 -0.0570344 -0.1170966 -0.0959491 -0.0895748 0.0047772 0.110438 0.0593945 -0.0373357 -0.056799 0.0086036 -0.098102 0.0715596 -0.117864 0.0048132 -0.0452008 0.0921091 -0.0343349 -0.0126667 -0.0276285 -0.1192155 0.1504456 0.0077084 -0.0361451 -0.0757483 -0.1550549 -0.0039323 -0.0284767 0.0081913 -0.1415734 1.4939634 0.1355415 0.0728393 -0.0995046 0.5888859 -0.5783364 0.5132708 -0.4277982 1.167273 1.0858872 -0.1287786 -0.4854113 -0.1575678 1.7309539 -0.308906 -0.4025928 -0.3678589 0.6142548 0.642134 -0.0735225 0.1395394 -0.0047807 0.2342345 0.033583 0.1115324 -0.0061196 0.2601483 0.0681738 -0.0735366 0.0190984 -0.0489959 0.0012712 0.0212883 -0.0054031 0.0379482 0.1476389 0.0761772 -0.0554881 0.0121277 -0.0606262 0.0212909 0.0202987 0.0392424 0.0047313 0.1523711 0.0276525 0.0836777 -0.0051784 0.097538 -0.0440565 0.0248718 0.0001613 0.0239747 0.1543209 -0.1082211 0.0114694 0.02637 -0.0043038 0.0872698 0.0084797 0.0266504 0.0076094 0.1552873 -0.0136054 -0.0145946 -0.0287349 -0.1017605 -0.0634911 0.0086659 0.0424559 0.0426449 0.1087171 -0.0111027 0.0345699 -0.0297364 0.0587346 0.0088054 -0.0847056 0.0604023 -0.1015562 0.0066469 0.037944 0.0165878 -0.0373004 0.045806 0.0977033 0.0656389 -0.0927774 0.0588999 -0.0771975 0.2175647 0.1373837 0.0662496 0.0919468 0.2828052 -0.0280129 0.0806543 -0.0858202 0.3612724 unknown
polarizability: 141.9023622|-9.3939547|121.8896291|-5.107303|-14.1454326|61.580424 unknown
InChI: InChI=1S/C9H8O4/c1-13-9(12)7-5-3-2-4-6(7)8(10)11/h2-5,10H,1H3
charge 0 multiplicity 1
21 atoms
O  2.012021 0.299591 0.873216
O  -0.729711 -2.763033 0.729094
O  2.01758 1.560619 -1.091166
O  1.048762 -1.96838 -0.530282
C  -0.095263 0.788213 -0.134749
C  -0.77064 -0.445234 0.099609
C  -0.847258 1.977962 -0.274786
C  -2.181161 -0.451496 0.247065
C  -2.252492 1.960441 -0.13943
C  -2.919295 0.745154 0.137104
C  1.399759 0.912496 -0.214731
C  -0.033675 -1.742646 0.058449
C  3.49257 0.247792 0.832886
H  -0.318234 2.913846 -0.480452
H  -2.685099 -1.404326 0.429146
H  -2.821315 2.890283 -0.244374
H  -4.008166 0.726896 0.250568
H  3.908103 1.243029 0.603336
H  3.805024 -0.474127 0.059808
H  3.791103 -0.091638 1.834332
H  -0.217912 -3.610742 0.632556
