program: Gaussian 09
title: 000244838
version: EM64L-G09RevD.01
frameworkgroup: C1[X(C13H18N2O6)]
method: RPBEPBE
basis: SDD
operation: Freq
keyword: #p
keyword: freq=noraman
keyword: PBEPBE/SDD
title: #p freq=noraman PBEPBE/SDD
converged: YES YES NO NO
title: Mulliken charges:
elementType: O O O O O O N N C C C C C C C C C C C C C H H H H H H H H H H H H H H H H H H
charge: -0.547757 -0.556230 -0.522963 -0.517157 -0.470684 -0.481222 -0.432789 -0.153880 -0.075025 -0.045672 -0.159237 -0.155180 -0.117070 0.107690 -0.380580 0.289429 0.010348 -0.377430 -0.346589 -0.214022 -0.230291 0.238891 0.237504 0.257837 0.258130 0.207971 0.242976 0.252148 0.389171 0.394140 0.412145 0.388144 0.391825 0.397026 0.240199 0.246996 0.369894 0.225201 0.226111
chargesum: 0.00000
title: Mulliken charges with hydrogens summed into heavy atoms:
elementType: O O O O O O N N C C C C C C C C C C C C C
charge: -0.153617 -0.144085 -0.134818 -0.125332 -0.073658 -0.111328 -0.043618 -0.153880 0.163866 0.191833 0.098600 0.102950 0.090901 0.107690 0.114544 0.289429 0.010348 -0.137231 -0.099593 0.011179 -0.004180
polarizability: 2.58428326e+02 1.05465510e+01 1.67767268e+02 9.13991480e+00 6.84037763e+00 1.04748385e+02
1716.lowfreq: -8.7303 -3.4231 -0.0008 -0.0004 0.0010 8.2627 28.6065 42.8838 53.1170
frequency: 28.2419 42.8734 53.0911 65.7104 77.0955 91.2451 132.2510 166.0154 174.0213 190.5123 207.2670 227.8681 261.5537 264.4048 312.1405 322.3461 327.2697 352.7055 374.8437 398.5962 417.5833 424.7710 437.4857 469.0744 496.4961 520.0814 547.6761 563.1921 578.2741 582.1427 592.1172 619.0457 629.7020 672.5165 705.3830 720.4597 753.3065 759.4483 770.7207 796.9698 827.6404 845.7968 860.2675 871.8376 884.4620 891.1382 919.8318 938.4766 942.1479 968.0767 974.4744 978.0794 988.6669 999.7617 1004.2964 1023.9561 1032.5130 1042.6520 1044.1915 1075.4432 1110.8419 1125.6261 1134.1636 1159.9433 1192.9358 1224.2275 1230.9370 1244.6355 1263.3885 1269.4551 1270.6003 1280.7363 1294.2086 1303.0187 1307.7644 1312.8154 1319.0546 1329.5973 1349.8960 1361.0644 1376.7076 1405.5877 1406.8019 1433.8765 1437.6700 1444.7652 1446.9113 1464.6289 1468.8253 1475.0644 1520.3916 1591.7779 1634.2700 2920.4123 2987.3246 3000.4701 3009.9153 3032.7002 3036.6134 3080.8429 3098.8846 3112.9488 3132.5577 3146.3271 3149.3712 3160.6324 3172.3874 3243.2688 3307.3589 3318.5362 3603.7901
redmass: 5.8667 5.9064 5.8479 6.5079 6.3615 6.3050 6.5816 2.6727 5.5292 7.3373 7.0367 5.4150 5.2768 5.8601 2.0792 3.3151 2.0402 4.7208 5.7228 5.1577 6.0685 4.5180 3.7198 5.0826 5.8960 3.4075 4.7098 4.6425 4.7064 3.8215 1.4490 4.7372 2.9448 3.7103 1.0966 1.1747 2.0929 2.0407 3.8120 1.1415 3.6259 3.3202 1.5017 1.3438 6.4909 2.0019 1.4445 1.8915 1.5478 3.3012 6.2095 1.3047 5.1355 5.3805 2.6081 4.1323 2.1988 4.8020 3.8885 2.7351 1.6380 3.4792 1.2928 1.1410 1.8565 1.3971 1.6841 1.1765 1.1569 2.1304 1.3079 1.1559 1.1727 1.8444 1.2459 1.2106 1.1768 1.2313 1.1780 1.1600 1.5642 2.0744 1.7969 2.6246 1.5335 4.0048 1.2088 1.1653 1.1930 3.4286 4.5883 6.9776 7.6528 1.0839 1.0843 1.0854 1.0863 1.0788 1.0668 1.0706 1.0700 1.1075 1.0854 1.0901 1.0658 1.0960 1.0996 1.0653 1.0646 1.0863 1.0667
irintensity: 0.3987 2.3886 7.6995 3.5479 1.2232 0.8330 2.8737 19.2241 3.0219 6.6267 8.6269 4.8648 10.6227 24.3013 25.7311 53.4298 83.5466 13.5390 17.4703 14.6452 9.5965 9.7345 6.0365 15.2437 6.9149 2.9849 18.6820 9.6804 17.4345 1.4021 25.0833 0.4469 2.4915 15.3290 10.3732 141.5918 45.0914 75.5919 1.6987 121.8149 3.9083 22.4385 0.4666 137.4981 8.4039 12.7563 63.9029 49.5127 108.8580 32.4996 33.2175 0.0054 72.3127 181.2294 26.6699 28.8129 31.8180 35.4479 5.0747 5.0856 2.2726 10.5020 8.1765 1.2813 52.4090 12.4156 7.5447 9.6058 1.9791 71.9046 8.2872 2.1863 96.9332 16.4411 11.7180 26.7946 6.2841 12.3845 14.0313 15.5877 455.2716 42.1332 19.1387 85.8666 78.1508 33.9563 46.5727 27.9043 155.8424 5.6260 80.6152 5.6669 12.4248 113.2800 22.6537 11.5072 75.9704 71.7415 14.9872 330.8770 1418.4523 85.1892 1.2159 9.8504 82.7508 21.8885 20.9113 189.4434 76.4560 692.1447 21.7703
temp: 298.150 k
press: 1.00000 atm
elementType: 8 8 8 8 8 8 7 7 6 6 6 6 6 6 6 6 6 6 6 6 6 1 1 1 1 1 1 1 1 1 1 1 1 1 1 1 1 1 1
symmnumber: 1
zpe: 813142.1 jmol-1
zpe.correction: 0.309709 hartree
zpe.thermalcorrener: 0.328761 hartree
zpe.thermalcorrenthalpy: 0.329705 hartree
zpe.thermalcorrgfe: 0.261999 hartree
zpe.sumelectzpe: -1065.421088 hartree
zpe.sumelectthermal: -1065.402037 hartree
zpe.sumelectthermalent: -1065.401093 hartree
zpe.sumelectthermalfe: -1065.468799 hartree
dipole: 2.2375 -2.4263 0.2735
dipole: 3.3118
quadrupole: -101.3204 -125.7266 -130.4683
quadrupole: -4.1663 9.7016 2.1776
quadrupole: 17.8513 -6.5549 -11.2965 -4.1663 9.7016 2.1776
hfenergy: -1065.7307977 hartree
pointgroup: C01 [X(C13H18N2O6)]
dipole: 0.8651886 0.2058321 -0.9522617 debye
polarizability: 259.1851011|-7.3756365|113.4154908|7.1981389|-23.0364089|158.3433865 unknown
InChI: InChI=1S/C13H18N2O6/c16-5-8(17)9(18)10(19)11(20)12(21)13-14-6-3-1-2-4-7(6)15-13/h1-4,8-12,14,16-21H,5H2
charge 0 multiplicity 1
39 atoms
O  0.941654 0.472221 -1.242856
O  1.810721 0.068399 2.349553
O  3.058004 -0.800824 -1.636645
O  -0.17603 -1.501915 2.423004
O  4.22181 0.752618 1.618766
O  5.317624 0.524407 -1.928266
N  -1.663196 0.076046 -0.610325
N  -2.48698 -0.88189 1.291027
C  1.790574 0.580733 -0.044772
C  0.918093 0.311421 1.208071
C  2.975285 -0.447105 -0.201402
C  -0.014782 -0.942704 1.073338
C  4.339628 0.089268 0.331748
C  -1.389181 -0.592936 0.567194
C  4.981877 1.134406 -0.607582
C  -3.056062 0.236536 -0.67571
C  -3.56443 -0.373148 0.527986
C  -3.905041 0.832388 -1.630785
C  -4.953565 -0.390486 0.782862
C  -5.289064 0.806569 -1.356439
C  -5.804999 0.204992 -0.170597
H  2.189998 1.611578 0.017939
H  0.295292 1.201367 1.427013
H  2.72445 -1.377882 0.33713
H  0.463714 -1.705739 0.431059
H  5.028622 -0.783006 0.410499
H  4.284706 1.955598 -0.836809
H  5.880239 1.555121 -0.123632
H  -0.888585 0.405132 -1.214658
H  1.540306 -0.02601 -1.896534
H  1.295175 -0.547063 2.956496
H  3.908261 -0.404863 -2.024193
H  -1.170916 -1.509399 2.596154
H  3.368638 0.459861 2.088245
H  -3.516782 1.294432 -2.543943
H  -5.34627 -0.853801 1.692954
H  6.194252 0.071083 -1.884344
H  -5.985008 1.258295 -2.071842
H  -6.887032 0.206801 -0.000209
