program: Gaussian 09
title: 000244836
version: EM64L-G09RevD.01
frameworkgroup: C1[X(C13H18N2O6)]
method: RPBEPBE
basis: SDD
operation: Freq
keyword: #p
keyword: freq=noraman
keyword: PBEPBE/SDD
title: #p freq=noraman PBEPBE/SDD
converged: YES YES NO NO
title: Mulliken charges:
elementType: O O O O O O N N C C C C C C C C C C C C C H H H H H H H H H H H H H H H H H H
charge: -0.427607 -0.462864 -0.536573 -0.487618 -0.473138 -0.493525 -0.427108 -0.239674 -0.168214 -0.204481 -0.104738 -0.178326 -0.140313 0.204311 -0.415489 0.272798 0.089794 -0.365493 -0.363484 -0.209585 -0.219470 0.270168 0.278377 0.240454 0.254235 0.265908 0.240691 0.206567 0.355785 0.352836 0.380348 0.385439 0.385112 0.365673 0.240553 0.267057 0.401194 0.229330 0.231067
chargesum: 0.00000
title: Mulliken charges with hydrogens summed into heavy atoms:
elementType: O O O O O O N N C C C C C C C C C C C C C
charge: -0.074771 -0.082517 -0.151134 -0.102507 -0.107465 -0.092331 -0.071322 -0.239674 0.101954 0.073896 0.135716 0.075910 0.125595 0.204311 0.031769 0.272798 0.089794 -0.124940 -0.096427 0.019746 0.011597
polarizability: 2.34473048e+02 1.42823479e+01 1.85800820e+02 -1.14499132e+01 -2.46704463e+00 1.06934726e+02
1716.lowfreq: -11.1162 -8.1375 0.0004 0.0005 0.0009 6.1386 30.7931 49.4449 63.0376
frequency: 30.7529 49.3995 62.9895 75.7686 97.2864 102.4584 132.1623 152.8045 164.6274 182.7732 194.0944 202.8972 252.7003 260.4094 263.1256 273.7178 304.2287 323.5100 330.3634 384.6623 390.6625 416.7926 425.0530 450.5789 496.3443 518.0950 522.7196 532.0663 563.5675 579.9691 612.3892 620.3818 640.7546 643.7053 680.9451 697.0811 716.1479 742.8090 760.8961 770.5111 771.5262 832.1200 833.0679 844.9542 864.1520 881.2408 891.5971 921.8289 944.9810 965.0894 977.8297 984.4016 986.8615 998.5208 1010.7179 1023.4879 1029.8049 1039.9212 1058.3447 1101.2249 1110.9076 1114.3939 1163.0189 1166.2611 1172.1463 1204.2129 1210.4222 1223.4169 1232.3309 1247.6148 1258.4634 1269.2215 1270.3546 1280.0337 1306.2135 1323.1608 1336.3156 1348.0507 1352.9494 1359.4452 1370.0182 1375.3539 1401.5108 1403.9720 1415.7930 1434.0322 1441.6618 1459.7677 1466.0083 1478.2944 1520.9678 1597.1130 1633.0425 2876.8987 2969.9323 2977.1234 2993.0866 3050.9316 3068.7831 3075.4616 3076.2046 3136.3400 3148.5843 3161.2365 3172.8497 3270.9028 3462.9316 3470.2093 3509.2107 3541.1818 3576.2885
redmass: 5.6865 5.4133 6.5234 5.2034 5.7355 6.4667 6.0258 6.4938 4.4691 5.4920 4.3283 3.9690 4.5704 5.5988 5.4374 5.3075 5.4175 5.3466 5.8541 2.0228 4.9965 1.9389 3.2217 3.8587 3.5369 4.7106 1.0850 1.1708 6.6351 3.6856 4.1105 6.1636 3.7189 1.1743 4.7914 1.3130 1.1426 3.7691 1.4786 3.1776 3.1719 3.6872 4.0139 3.6032 1.4531 5.3031 2.9879 3.0112 1.3706 1.2365 5.9812 1.3107 2.7906 3.0570 2.8747 4.2537 4.9942 3.6009 2.7840 2.5041 2.1335 1.8218 1.1510 1.2533 1.0950 1.4128 1.7226 1.4403 1.2469 1.2501 1.3781 1.3595 2.9060 1.3550 1.6777 1.2645 1.2754 1.2049 1.2960 1.5134 1.1921 1.3877 4.3520 1.5984 3.6605 1.1925 3.0698 1.0910 1.1524 3.0817 5.2221 7.1247 7.6371 1.0758 1.0838 1.0664 1.0819 1.0865 1.0966 1.0857 1.0876 1.0857 1.0902 1.0961 1.1004 1.0671 1.0645 1.0651 1.0652 1.0651 1.0813
irintensity: 1.2965 1.0209 0.9275 1.7835 6.1763 0.7473 1.6298 0.0300 6.6073 17.1478 7.4264 18.9396 5.1329 1.5469 15.5187 4.6919 10.5151 8.1920 4.9625 50.3034 3.9927 67.4961 6.8489 6.0938 9.6258 9.3039 38.5365 103.8033 4.8172 0.4857 50.3338 4.1420 31.1709 137.5985 4.2453 173.9332 80.9098 3.4858 129.2670 31.4704 11.9303 12.0783 4.7997 37.9697 0.0714 6.6422 23.9875 28.8043 4.3185 155.8976 42.7655 1.2204 81.8556 32.6378 11.2534 36.9525 40.0144 28.6510 168.5472 10.7664 15.5466 10.8509 5.7756 72.1340 36.0480 27.7279 31.3991 33.1446 36.4786 75.0049 6.7284 47.5449 18.1441 11.1888 2.9139 21.8645 8.8892 41.8625 12.1479 44.6078 19.6659 73.4703 33.9570 7.7410 17.6773 98.9009 37.2281 9.6914 23.9526 1.2116 38.1536 6.2791 3.1871 1301.0426 27.2935 68.9098 23.8470 25.4941 13.3927 15.8593 24.0297 1.0195 8.8141 13.3393 18.5702 242.1332 57.3657 22.3572 43.6191 18.5378 105.8617
temp: 298.150 k
press: 1.00000 atm
elementType: 8 8 8 8 8 8 7 7 6 6 6 6 6 6 6 6 6 6 6 6 6 1 1 1 1 1 1 1 1 1 1 1 1 1 1 1 1 1 1
symmnumber: 1
zpe: 813870.4 jmol-1
zpe.correction: 0.309987 hartree
zpe.thermalcorrener: 0.329499 hartree
zpe.thermalcorrenthalpy: 0.330444 hartree
zpe.thermalcorrgfe: 0.262501 hartree
zpe.sumelectzpe: -1065.427061 hartree
zpe.sumelectthermal: -1065.407549 hartree
zpe.sumelectthermalent: -1065.406605 hartree
zpe.sumelectthermalfe: -1065.474548 hartree
dipole: -2.9293 1.8722 -0.3171
dipole: 3.4910
quadrupole: -114.6957 -125.3033 -129.9377
quadrupole: -2.1409 -7.1903 -4.1034
quadrupole: 8.6165 -1.9911 -6.6255 -2.1409 -7.1903 -4.1034
hfenergy: -1065.7370481 hartree
pointgroup: C01 [X(C13H18N2O6)]
dipole: 1.1456525 -0.5264059 -0.5447333 debye
polarizability: 233.694461|18.5001952|175.5529698|-2.1257468|28.0766891|117.9611642 unknown
InChI: InChI=1S/C13H18N2O6/c16-5-8(17)9(18)10(19)11(20)12(21)13-14-6-3-1-2-4-7(6)15-13/h1-4,8-12,14,16-21H,5H2
charge 0 multiplicity 1
39 atoms
O  -2.661029 -1.401371 2.074858
O  -2.669576 -2.558579 -0.62757
O  -3.900914 -0.186632 -0.220133
O  -0.232707 -2.499331 -2.065697
O  -3.814309 2.462935 0.462742
O  -0.919499 2.745381 0.44604
N  1.843201 -1.157876 -1.095447
N  0.67486 0.654919 -0.387379
C  -1.88992 -0.809587 0.982738
C  -1.490004 -1.882138 -0.055868
C  -2.635685 0.361755 0.321177
C  -0.657132 -1.345509 -1.262329
C  -2.929731 1.55883 1.240479
C  0.593917 -0.591785 -0.901422
C  -1.639136 2.303173 1.642107
C  2.811611 -0.226485 -0.69097
C  2.06133 0.912119 -0.240629
C  4.221092 -0.250356 -0.672607
C  2.721389 2.063247 0.243953
C  4.866939 0.905809 -0.185281
C  4.13079 2.041971 0.264907
H  -0.975335 -0.427908 1.463084
H  -0.915674 -2.679522 0.448301
H  -2.034466 0.753373 -0.522678
H  -1.313654 -0.688467 -1.869005
H  -3.513099 1.249649 2.12385
H  -1.911355 3.213486 2.203252
H  -1.009017 1.665447 2.295571
H  1.959907 -2.075897 -1.526925
H  -3.461633 -1.830667 1.674331
H  -3.368536 -1.849252 -0.783511
H  -4.493434 0.599461 -0.377512
H  -1.030668 -3.089732 -2.135112
H  -3.201315 3.020268 -0.093304
H  4.794074 -1.116914 -1.017161
H  2.149001 2.932491 0.582366
H  -0.355866 1.969355 0.077459
H  5.961408 0.932543 -0.152312
H  4.676773 2.916996 0.633041
