program: Gaussian 09
title: 000244831
version: EM64L-G09RevD.01
frameworkgroup: C1[X(C11H13N3O3)]
method: RPBEPBE
basis: SDD
operation: Freq
keyword: #p
keyword: freq=noraman
keyword: PBEPBE/SDD
title: #p freq=noraman PBEPBE/SDD
converged: YES YES NO NO
title: Mulliken charges:
elementType: O O O N N N C C C C C C C C C C C H H H H H H H H H H H H H
charge: -0.422364 -0.470265 -0.434205 -0.245992 -0.169911 -0.021783 -0.200353 -0.210967 0.294188 -0.324935 -0.421158 0.441648 -0.355426 -0.365900 -0.191133 -0.190896 -0.243052 0.233271 0.273517 0.205545 0.211452 0.282193 0.356592 0.366807 0.260206 0.283720 0.353708 0.234516 0.234356 0.236621
chargesum: 0.00000
title: Mulliken charges with hydrogens summed into heavy atoms:
elementType: O O O N N N C C C C C C C C C C C
charge: -0.065772 -0.103458 -0.080497 -0.245992 -0.169911 -0.021783 0.032918 0.062550 0.294188 0.092062 -0.138965 0.441648 -0.095220 -0.082179 0.043383 0.043460 -0.006431
polarizability: 2.17577593e+02 -2.11040815e+01 1.48933118e+02 4.20658135e+00 2.18061806e+01 9.36280857e+01
1716.lowfreq: -12.3689 -4.8991 -0.0007 0.0001 0.0003 10.3847 23.2021 39.3750 62.2339
frequency: 22.9542 39.2257 62.2211 84.2254 106.7541 110.1354 141.0994 176.9773 196.1997 256.2489 267.2929 314.5002 338.9901 354.2794 406.6205 437.1954 459.1083 478.0715 497.3769 501.1336 512.4363 608.0309 615.0105 653.8138 689.0999 694.4660 714.9627 724.7093 770.3448 776.8018 826.7695 849.0772 851.6181 928.5578 933.3264 935.0757 970.1336 984.1403 988.1584 988.9158 1001.2261 1014.3009 1023.8314 1057.2472 1060.8524 1075.7095 1083.3843 1123.7504 1167.0921 1171.8644 1174.4366 1182.9027 1216.6746 1236.7699 1276.3608 1291.4434 1310.4448 1320.6811 1333.1998 1354.2167 1371.5515 1385.2265 1388.7224 1402.7400 1414.6098 1452.0909 1470.5580 1478.3570 1492.2702 1602.2103 1609.7921 2960.1799 3055.9349 3057.0407 3071.4611 3138.2394 3149.4794 3166.4370 3182.8922 3187.4851 3250.8802 3303.0062 3493.5325 3504.8080
redmass: 4.2065 6.1260 6.3279 4.4202 3.4211 5.5065 5.7486 6.1781 5.2070 5.4104 4.8005 5.7121 6.4514 4.9812 2.8886 4.8011 1.1492 5.4197 1.1501 3.1397 3.3920 4.0866 4.8314 8.4662 5.8405 2.0645 3.5964 1.2842 1.6166 3.6611 2.7127 1.2472 1.4989 7.2706 1.4585 7.2933 2.0120 1.3701 6.0514 4.8950 1.3196 3.5416 3.2672 2.5499 4.2166 2.1240 2.0250 3.0259 1.1183 1.6887 1.0622 1.1224 1.2315 1.7358 1.7082 2.2970 1.9340 1.3296 1.2479 4.3042 1.2298 4.4241 1.2729 3.6892 1.2063 2.3908 1.0964 3.3008 3.7298 6.9559 6.1240 1.0668 1.0871 1.0873 1.0934 1.0858 1.0905 1.0957 1.0950 1.0979 1.0997 1.0663 1.0654 1.0651
irintensity: 0.0063 0.0389 0.5149 3.9503 10.8621 1.8400 6.9080 2.7368 8.6759 5.9513 10.5940 1.1538 2.9298 0.5877 0.0213 8.8351 44.2647 11.0083 174.5647 4.6220 5.4174 7.0723 3.7864 9.2923 18.1875 18.4438 45.3287 212.3499 80.7159 18.9757 30.4067 0.0860 32.5563 91.9045 17.6529 23.9474 10.7959 0.0723 6.9400 87.1669 1.0990 3.7660 14.2451 4.8697 35.5864 14.4887 10.1333 1.5563 48.7354 5.5419 0.1129 2.1576 58.7034 9.0606 11.4863 30.4669 58.6423 2.2266 32.7862 1.6931 29.3696 0.8702 43.8228 3.9411 51.0890 9.4381 1.9635 13.3924 69.5755 1.9076 18.0914 60.6835 12.1715 4.2928 64.9168 0.1875 13.9587 25.0223 3.6028 3.9369 0.3405 255.2697 15.3980 13.7226
temp: 298.150 k
press: 1.00000 atm
elementType: 8 8 8 7 7 7 6 6 6 6 6 6 6 6 6 6 6 1 1 1 1 1 1 1 1 1 1 1 1 1
symmnumber: 1
zpe: 612081.0 jmol-1
zpe.correction: 0.233129 hartree
zpe.thermalcorrener: 0.248392 hartree
zpe.thermalcorrenthalpy: 0.249336 hartree
zpe.thermalcorrgfe: 0.189085 hartree
zpe.sumelectzpe: -815.588844 hartree
zpe.sumelectthermal: -815.573581 hartree
zpe.sumelectthermalent: -815.572637 hartree
zpe.sumelectthermalfe: -815.632888 hartree
dipole: -3.8627 -0.7312 -0.4408
dipole: 3.9560
quadrupole: -97.2433 -102.5401 -104.6265
quadrupole: -11.1680 -2.0220 10.6328
quadrupole: 4.2266 -1.0701 -3.1565 -11.1680 -2.0220 10.6328
hfenergy: -815.8219733 hartree
pointgroup: C01 [X(C11H13N3O3)]
dipole: -1.5183916 0.310468 0.1430039 debye
polarizability: 217.7348744|20.2913309|152.7226479|-6.4132339|15.5455185|89.6812749 unknown
InChI: InChI=1S/C11H13N3O3/c15-7-10(16)11(17)9-6-12-14(13-9)8-4-2-1-3-5-8/h1-6,10-11,15-17H,7H2
charge 0 multiplicity 1
30 atoms
O  3.194747 1.346088 -1.706209
O  2.586861 -1.398113 -0.978064
O  3.677458 -2.378551 1.460846
N  -0.725361 0.818388 0.087205
N  0.473146 0.211168 -0.223059
N  -0.612047 2.137788 0.472473
C  2.876875 0.968216 -0.314027
C  3.32807 -0.489755 -0.065525
C  1.409277 1.198873 -0.025796
C  3.197275 -0.998182 1.381748
C  0.730878 2.376923 0.398163
C  -1.987735 0.141984 0.030632
C  -2.043194 -1.208965 -0.384528
C  -3.159643 0.84623 0.39508
C  -3.294063 -1.859084 -0.432219
C  -4.400931 0.179936 0.340896
C  -4.475854 -1.171432 -0.070973
H  3.481037 1.658804 0.299145
H  4.379335 -0.583778 -0.388861
H  2.143425 -0.92454 1.7254
H  3.838911 -0.4146 2.064778
H  1.131182 3.357341 0.640267
H  2.922412 0.575682 -2.275848
H  1.608688 -1.22678 -0.819042
H  -1.126409 -1.734097 -0.663473
H  -3.083811 1.889506 0.711055
H  3.311302 -2.848424 0.663825
H  -3.343086 -2.90501 -0.752914
H  -5.311691 0.719107 0.622092
H  -5.443457 -1.682422 -0.110067
