program: Gaussian 09
title: 000244828
version: EM64L-G09RevD.01
frameworkgroup: C1[X(C26H18N2O3)]
method: RPBEPBE
basis: SDD
operation: Freq
keyword: #p
keyword: freq=noraman
keyword: PBEPBE/SDD
title: #p freq=noraman PBEPBE/SDD
converged: YES YES NO NO
title: Mulliken charges:
elementType: O O O N N C C C C C C C C C C C C C C C C C C C C C C C C C C H H H H H H H H H H H H H H H H H H
charge: -0.218045 -0.220952 -0.278745 -0.093241 -0.075584 0.316391 0.309794 0.378540 0.011948 -0.343232 -0.345858 0.294245 0.182082 -0.335669 -0.389321 0.010978 0.292433 -0.346615 -0.351525 -0.379975 -0.309730 -0.366887 -0.356413 -0.368343 -0.358056 -0.235335 -0.230390 -0.236006 -0.230777 -0.227026 -0.228349 0.277283 0.275035 0.289129 0.294024 0.270847 0.274360 0.254008 0.309692 0.266057 0.273068 0.266192 0.272556 0.234644 0.235436 0.233028 0.234177 0.235795 0.234334
chargesum: 0.00000
title: Mulliken charges with hydrogens summed into heavy atoms:
elementType: O O O N N C C C C C C C C C C C C C C C C C C C C C C C C C C
charge: -0.218045 -0.220952 -0.278745 -0.093241 -0.075584 0.316391 0.309794 0.378540 0.011948 -0.065949 -0.070823 0.294245 0.182082 -0.046540 -0.095297 0.010978 0.292433 -0.075767 -0.077166 -0.125968 -0.000039 -0.100830 -0.083345 -0.102151 -0.085500 -0.000691 0.005046 -0.002978 0.003400 0.008769 0.005985
polarizability: 7.26725568e+02 -1.71636954e+01 2.90156301e+02 -3.07266312e+01 -3.23290675e+00 1.52440416e+02
1716.lowfreq: -7.7554 -1.9663 -0.0015 0.0006 0.0017 1.9846 12.9452 18.5675 30.3648
frequency: 12.1110 18.4451 30.3333 32.3942 47.9291 52.0036 67.1085 74.2608 82.9879 95.6280 107.7745 132.0788 135.8825 166.2417 190.0695 200.0720 225.9684 259.4740 261.9355 302.9883 322.7514 336.3067 361.2992 387.8276 395.7200 403.3439 403.7120 416.2907 416.9352 438.9644 455.6652 464.2969 496.0665 515.9133 561.5444 566.1633 611.0370 613.1858 614.0232 626.7201 631.1153 646.6337 657.1471 681.0764 684.2804 694.2786 703.3195 704.5239 728.4995 753.9813 756.2906 802.7683 803.8859 817.0847 848.8464 853.5921 857.5205 862.9959 865.8621 874.2818 881.8617 914.3141 916.8887 946.8734 948.6333 982.6203 988.0108 989.0166 989.0687 992.2651 998.0788 999.0662 1002.5352 1004.6509 1005.8465 1006.5801 1008.0111 1026.2053 1026.7858 1073.6650 1084.5236 1085.0870 1110.8484 1118.1355 1150.1731 1150.4866 1166.5412 1174.8871 1175.5502 1182.2976 1189.1700 1190.8396 1215.3903 1219.6604 1279.4552 1282.6918 1297.7187 1303.3050 1319.4833 1319.7310 1344.9000 1376.5446 1383.6298 1384.3629 1391.3691 1409.7000 1421.2490 1433.4536 1434.2533 1471.2925 1475.5920 1478.4320 1482.0935 1525.3276 1536.8547 1548.9484 1583.8405 1586.2339 1590.7957 1605.3007 1606.3947 1609.1011 1610.0752 3128.9156 3130.2382 3138.5824 3139.7772 3147.7989 3150.0843 3150.5910 3155.7000 3157.2729 3159.1680 3160.1926 3161.1011 3169.5824 3170.5327 3171.0582 3187.8738 3197.5829 3220.4023
redmass: 6.2623 6.3837 5.8829 5.2759 5.0605 5.7703 5.5310 4.5504 5.7052 5.8489 6.2905 8.4153 7.3753 5.6451 6.0336 5.9034 5.9474 6.2258 7.0390 5.5376 7.7054 6.5693 8.3543 6.8121 5.1688 2.8425 2.8888 2.9768 2.9769 4.1346 4.7135 4.2367 7.5778 4.7035 4.3958 4.7130 6.8628 6.4394 6.4978 7.0710 6.5658 6.3344 6.0460 4.0188 4.1879 5.3236 1.6538 1.6643 5.4152 2.9511 2.7969 2.5450 2.5742 6.4733 1.4133 5.5446 1.2581 1.2518 1.2595 1.7414 1.7966 5.0889 4.8324 1.4959 1.4870 1.3754 1.3904 5.8523 4.8793 1.4289 1.4235 1.6649 1.5849 1.6302 1.5533 1.4820 1.8872 2.1665 2.1618 3.7173 1.5896 1.5818 1.3171 1.3543 3.2679 3.1899 1.4549 1.0569 1.0581 1.2020 1.1350 1.1652 3.1342 3.5188 3.6877 3.5354 1.3393 1.3881 1.3617 1.3605 6.3190 5.1717 8.7467 8.6242 7.8196 4.0618 4.5910 2.2670 2.2704 2.3185 2.2445 2.3584 2.5456 9.0173 10.3425 7.5527 6.4555 6.2112 7.4345 6.1592 6.1338 6.2706 6.4052 1.0851 1.0852 1.0882 1.0881 1.0895 1.0924 1.0910 1.0913 1.0910 1.0962 1.0952 1.0908 1.1007 1.1014 1.0975 1.0947 1.0949 1.0936
irintensity: 0.7752 1.8015 0.1910 0.5282 0.0611 0.6769 2.7822 0.1643 2.6016 0.7940 1.5123 2.0485 5.6632 0.2443 0.5369 1.2874 13.6156 0.3181 0.9340 1.1891 13.6477 0.6618 9.2320 20.3311 1.7025 2.8108 0.9833 0.0575 0.1706 3.8715 0.1237 0.2176 7.6336 18.9210 4.1154 0.9189 26.6326 0.1525 3.2990 0.0875 19.1553 1.8844 11.4079 38.0678 9.5262 25.1791 12.2869 156.4894 7.0161 23.9551 30.2461 1.6018 16.5496 6.3997 31.6922 33.2399 7.1269 4.0491 1.1834 18.5880 88.5207 135.1861 72.0391 6.9297 5.5220 2.6713 5.2656 7.1632 2.9847 1.3216 1.2185 9.9049 9.0722 0.3410 1.8235 3.9428 1.5823 3.6681 3.9781 9.5652 11.8406 9.0899 19.4970 17.4962 5.8490 5.1133 16.6183 0.6154 0.6987 19.5725 77.1173 1.4699 24.0556 65.2297 1030.3367 27.1297 38.4388 21.4474 37.8618 8.1117 53.7433 69.5638 1.9560 4.3592 35.3126 52.1769 4.4453 19.3013 19.9681 0.9441 5.4020 0.7231 4.3791 114.4709 130.4578 57.7495 4.2506 10.8134 9.0350 11.9151 93.4455 0.0617 1.1196 0.8538 0.5985 5.7688 5.3866 24.9261 24.7454 6.5922 1.5455 7.7125 17.8016 14.9155 0.5720 20.7436 28.7235 13.1303 1.6369 0.8132 2.6578
temp: 298.150 k
press: 1.00000 atm
elementType: 8 8 8 7 7 6 6 6 6 6 6 6 6 6 6 6 6 6 6 6 6 6 6 6 6 6 6 6 6 6 6 1 1 1 1 1 1 1 1 1 1 1 1 1 1 1 1 1 1
symmnumber: 1
zpe: 969182.1 jmol-1
zpe.correction: 0.369142 hartree
zpe.thermalcorrener: 0.394291 hartree
zpe.thermalcorrenthalpy: 0.395235 hartree
zpe.thermalcorrgfe: 0.310218 hartree
zpe.sumelectzpe: -1334.574882 hartree
zpe.sumelectthermal: -1334.549733 hartree
zpe.sumelectthermalent: -1334.548789 hartree
zpe.sumelectthermalfe: -1334.633807 hartree
dipole: 1.6418 1.3395 0.5714
dipole: 2.1946
quadrupole: -135.2113 -183.3965 -179.7725
quadrupole: -45.4943 -1.0884 -1.2545
quadrupole: 30.9154 -17.2698 -13.6457 -45.4943 -1.0884 -1.2545
hfenergy: -1334.9440244 hartree
pointgroup: C01 [X(C26H18N2O3)]
dipole: 0.6457567 -0.1617064 -0.54988 debye
polarizability: 727.4890707|2.2806814|215.3245344|27.0839443|69.5287056|226.5086794 unknown
InChI: InChI=1S/C26H18N2O3/c29-25(19-7-3-1-4-8-19)21-11-15-23(16-12-21)27-28(31)24-17-13-22(14-18-24)26(30)20-9-5-2-6-10-20/h1-18H
charge 0 multiplicity 1
49 atoms
O  6.026747 -1.667604 -1.75647
O  -6.5226 1.603768 1.800285
O  0.380711 0.640785 2.277675
N  0.498821 0.233512 1.026672
N  -0.472958 0.019555 0.151102
C  4.500716 -0.449328 -0.362542
C  -4.657371 0.493977 0.775904
C  1.862321 -0.014808 0.525008
C  5.88333 -0.766114 -0.871223
C  3.399205 -0.682144 -1.23077
C  4.252254 -0.013417 0.966531
C  7.079942 -0.031074 -0.340256
C  -1.828109 0.219921 0.493764
C  2.080696 -0.457663 -0.801663
C  2.934662 0.198595 1.417528
C  -6.130713 0.725411 0.966933
C  -7.138781 -0.066177 0.182214
C  -4.096035 0.069316 -0.462283
C  -3.783387 0.795041 1.854896
C  -2.707016 -0.058367 -0.600363
C  -2.390183 0.655185 1.739886
C  7.006512 1.302881 0.146764
C  8.344318 -0.678098 -0.404673
C  -6.893799 -1.393171 -0.265261
C  -8.414608 0.518065 -0.045251
C  8.176534 1.970383 0.56972
C  9.507567 -0.016603 0.034056
C  -7.904867 -2.115175 -0.936467
C  -9.416004 -0.19721 -0.73025
C  9.426412 1.310399 0.523507
C  -9.163153 -1.516763 -1.17894
H  3.602772 -1.0484 -2.241846
H  5.086269 0.129592 1.660198
H  1.225581 -0.618712 -1.460388
H  2.718224 0.521385 2.438474
H  -4.746137 -0.126063 -1.320521
H  -4.225113 1.149425 2.792036
H  -2.258512 -0.36877 -1.549054
H  -1.735262 0.87697 2.581192
H  6.04662 1.829581 0.160684
H  8.387719 -1.69535 -0.807612
H  -5.931204 -1.872118 -0.057629
H  -8.596933 1.530144 0.331037
H  8.114964 3.003379 0.928811
H  10.475949 -0.526701 -0.007442
H  -7.714482 -3.143087 -1.263883
H  -10.392215 0.265349 -0.911685
H  10.332166 1.827907 0.858776
H  -9.943969 -2.076511 -1.705984
