program: Gaussian 09
title: 000244825
version: EM64L-G09RevD.01
frameworkgroup: C1[X(C17H14N2O)]
method: RPBEPBE
basis: SDD
operation: Freq
keyword: #p
keyword: freq=noraman
keyword: PBEPBE/SDD
title: #p freq=noraman PBEPBE/SDD
converged: YES YES NO NO
title: Mulliken charges:
elementType: O N N C C C C C C C C C C C C C C C C C H H H H H H H H H H H H H H
charge: -0.249630 -0.438474 -0.039519 0.497057 0.486639 -0.426273 -0.301206 -0.380842 -0.376107 -0.484916 0.354435 0.245880 -0.365904 -0.390580 -0.233017 -0.238607 -0.242938 0.217783 -0.311456 -0.798820 0.228514 0.256692 0.223586 0.311746 0.223953 0.315031 0.251144 0.224418 0.230369 0.228167 0.232561 0.239938 0.271480 0.238895
chargesum: 0.00000
title: Mulliken charges with hydrogens summed into heavy atoms:
elementType: O N N C C C C C C C C C C C C C C C C C
charge: -0.249630 -0.123443 -0.039519 0.497057 0.486639 -0.197758 -0.044514 -0.157256 -0.064361 -0.260963 0.354435 0.245880 -0.114761 -0.166161 -0.002649 -0.010440 -0.010376 0.217783 -0.311456 -0.048507
polarizability: 4.72420697e+02 -5.52051635e+00 2.04036316e+02 3.27253128e+00 -2.51338496e+00 8.60329615e+01
1716.lowfreq: -74.6550 -6.8094 -2.2483 -0.0008 -0.0007 -0.0002 3.6401 25.2891 31.6549
frequency: -74.6479 25.2464 31.6504 39.8514 61.2873 75.2344 88.4113 131.2872 142.0310 151.5403 176.5239 231.3639 261.5629 306.9638 339.5441 355.6213 377.9874 390.5862 402.4310 416.4222 465.5098 486.6302 524.8573 537.8988 582.8906 614.8311 625.4102 631.2854 651.0441 653.7640 677.6429 695.0769 744.3404 763.3536 773.8936 804.2948 834.3608 839.6406 847.0992 855.3460 920.8444 928.3191 929.8470 969.8588 976.9383 983.6230 987.5570 992.3656 995.8862 996.9710 1006.2675 1031.8729 1034.1556 1091.2653 1132.6422 1175.6909 1197.4447 1201.8389 1220.6212 1224.3523 1265.7089 1273.7601 1311.9604 1328.6796 1346.7446 1377.0280 1378.1783 1391.3308 1427.6432 1439.2117 1448.3079 1467.9640 1484.5703 1490.9507 1509.4353 1575.9005 1581.3689 1588.8285 1611.1777 1622.2423 1637.8142 2149.3834 2988.1415 3072.8080 3109.1667 3115.3461 3126.0072 3126.5737 3132.1942 3138.0692 3143.5676 3152.2916 3167.9989 3190.1741 3198.5235 3517.1026
redmass: 1.0467 4.5311 4.2193 6.1244 5.4648 4.5653 4.5980 5.1956 9.9383 5.0693 7.4032 4.2816 4.5411 5.8154 6.1477 4.5325 4.3427 4.5428 2.8207 3.1059 7.0507 3.6386 4.4848 2.6372 2.8976 6.3943 6.5454 6.3672 3.0204 1.3847 6.2476 1.7751 3.4273 6.6828 1.9239 4.5414 1.3878 3.3337 1.4664 1.4313 1.4178 1.5854 5.9021 1.3935 1.4156 1.7736 5.0353 5.3699 1.3495 1.3513 2.4855 1.6642 2.0231 1.6277 1.4382 1.0531 1.2313 1.1450 2.9077 1.9326 2.7559 2.5448 1.5452 1.5517 2.0659 1.9496 1.9036 2.4154 3.4402 2.2881 1.2114 1.0466 2.2247 2.0301 2.6832 4.6644 5.1046 6.2883 6.1069 5.7629 5.3666 12.6300 1.0385 1.0983 1.0875 1.0907 1.0895 1.0858 1.0872 1.0979 1.0919 1.0963 1.1017 1.0930 1.0946 1.0764
irintensity: 0.0615 1.4514 3.6157 5.3441 2.5575 5.6444 0.3422 3.6681 0.3932 1.8346 3.8909 0.5700 1.6657 0.5267 2.6441 7.0710 0.6454 0.3172 0.1180 0.0591 0.9108 0.9469 4.3659 44.6112 1.9128 1.5138 6.7208 24.2648 20.2401 44.6633 1.0428 49.1314 4.4459 2.9003 53.7058 1.1298 26.9294 0.1301 0.2549 43.9617 16.3357 23.5707 8.9810 0.0112 0.3463 43.6739 0.8948 9.9987 1.4415 0.0785 10.2752 8.3802 3.2628 6.7506 14.1141 0.1737 46.1011 6.2069 175.5953 3.9308 0.9475 70.8748 31.1755 178.7497 113.7059 12.3739 74.0232 6.3364 68.6793 31.9857 74.0284 20.5061 3.3513 565.3515 167.4894 26.5934 46.7358 104.4839 2.3419 123.3956 125.3554 60.2718 7.7483 13.8625 18.1738 26.0312 11.2836 2.8419 0.5570 7.9091 9.1530 29.9947 35.6083 3.2072 3.2547 15.7251
temp: 298.150 k
press: 1.00000 atm
elementType: 8 7 7 6 6 6 6 6 6 6 6 6 6 6 6 6 6 6 6 6 1 1 1 1 1 1 1 1 1 1 1 1 1 1
symmnumber: 1
zpe: 690838.8 jmol-1
zpe.correction: 0.263127 hartree
zpe.thermalcorrener: 0.280284 hartree
zpe.thermalcorrenthalpy: 0.281228 hartree
zpe.thermalcorrgfe: 0.215892 hartree
zpe.sumelectzpe: -839.556430 hartree
zpe.sumelectthermal: -839.539273 hartree
zpe.sumelectthermalent: -839.538329 hartree
zpe.sumelectthermalfe: -839.603665 hartree
dipole: 2.0073 -0.1388 0.2498
dipole: 2.0275
quadrupole: -86.0174 -121.6067 -122.2382
quadrupole: 29.8583 3.8233 -2.2906
quadrupole: 23.9367 -11.6526 -12.2841 29.8583 3.8233 -2.2906
hfenergy: -839.819557 hartree
pointgroup: C01 [X(C17H14N2O1)]
dipole: 0.7835406 0.0961408 0.1146157 debye
polarizability: 471.0133282|10.6844476|93.4409065|19.2253332|-27.7340465|198.0357402 unknown
InChI: InChI=1S/C17H14N2O/c1-13(20)19-17-9-7-14(8-10-17)11-16(12-18)15-5-3-2-4-6-15/h2-11,19H,1H3
charge 0 multiplicity 1
34 atoms
O  5.55886 -0.446348 1.916747
N  4.753587 0.350015 -0.141916
N  -1.744193 0.992425 -2.939263
C  0.489613 0.054114 0.18408
C  3.349593 0.230963 0.018919
C  1.336347 -0.345286 1.264178
C  1.129402 0.552029 -0.993935
C  -0.952075 -0.077718 0.384465
C  2.736655 -0.26671 1.201927
C  2.525714 0.636583 -1.070059
C  -3.450476 0.002613 -0.00948
C  -2.032177 0.183293 -0.445287
C  -4.48651 -0.127132 -0.977009
C  -3.810224 -0.038051 1.368055
C  -5.827615 -0.316202 -0.583487
C  -5.150301 -0.229711 1.759544
C  -6.168193 -0.374023 0.786913
C  5.774658 0.025007 0.764348
C  -1.851589 0.626202 -1.803414
C  7.178796 0.295069 0.225207
H  0.875118 -0.730728 2.182138
H  0.538944 0.874571 -1.853663
H  -1.216614 -0.467442 1.376885
H  3.361757 -0.578014 2.039872
H  2.988424 1.023304 -1.987468
H  5.059719 0.724194 -1.044076
H  -4.238229 -0.0867 -2.043551
H  -3.050014 0.11218 2.14242
H  -6.605758 -0.41807 -1.347808
H  -5.404334 -0.251277 2.825155
H  -7.209712 -0.517814 1.094038
H  7.383454 -0.304166 -0.681495
H  7.909597 0.022839 0.999705
H  7.313579 1.362489 -0.030685
