program: Gaussian 09
title: 000244814
version: EM64L-G09RevD.01
frameworkgroup: C1[X(C6H8N2O4S)]
method: RPBEPBE
basis: SDD
operation: Freq
keyword: #p
keyword: freq=noraman
keyword: PBEPBE/SDD
title: #p freq=noraman PBEPBE/SDD
converged: YES YES NO NO
title: Mulliken charges:
elementType: S O O O O N N C C C C C C H H H H H H H H
charge: 0.929105 -0.262284 -0.567650 -0.511775 -0.245991 -0.340906 0.079400 -0.144316 -0.724763 0.148674 0.230416 -0.355096 -0.512889 0.397042 0.270897 0.294181 0.293962 0.275926 0.238411 0.279159 0.228498
chargesum: 0.00000
title: Mulliken charges with hydrogens summed into heavy atoms:
elementType: S O O O O N N C C C C C C
charge: 0.929105 -0.262284 -0.567650 -0.511775 -0.245991 0.056136 0.079400 -0.144316 0.134277 0.148674 0.230416 -0.079170 0.233178
polarizability: 1.88618098e+02 -8.87657516e+00 1.16198063e+02 1.18111339e-01 -2.15302963e+00 7.63032401e+01
1716.lowfreq: -8.6191 -5.0761 -0.0010 0.0014 0.0015 2.3571 40.8352 47.3612 65.5262
frequency: 40.8053 47.3556 65.5174 102.2315 113.5042 143.4720 151.0136 178.3281 190.7925 229.3637 248.8544 282.8112 322.8148 344.8851 376.0322 390.2802 441.0415 469.1852 536.9156 566.2014 618.0140 629.3634 687.3583 745.3005 782.0467 863.3113 885.3923 886.5716 892.2322 923.3367 974.6337 1015.7781 1072.6334 1099.1167 1109.0310 1157.7087 1234.8012 1250.0696 1303.5219 1327.7236 1405.4373 1409.7307 1418.4357 1429.6086 1453.7960 1471.6361 1520.4862 1572.0268 1626.0661 3003.3053 3031.7582 3117.5456 3154.9271 3182.7325 3187.1560 3187.4395 3339.3724
redmass: 3.0484 5.2655 2.4447 3.5688 2.5344 2.1130 1.3147 5.3357 7.7985 5.3125 4.0700 6.6620 10.1375 6.4162 6.0392 6.9440 4.4139 7.6290 9.2624 8.1816 11.0295 6.7386 6.1387 6.8402 12.8727 1.1860 5.8184 1.4404 3.8608 10.3131 1.3090 1.7723 2.7034 3.7365 1.2343 1.6688 2.5189 4.5377 1.1373 2.1013 1.9404 1.0589 1.0549 1.2767 1.0710 1.0526 5.2003 7.5735 8.8654 1.0321 1.0243 1.1005 1.1067 1.1077 1.0935 1.1079 1.0778
irintensity: 8.4836 3.2601 3.3038 6.8386 4.6424 0.8130 3.3507 3.9824 4.8765 1.2666 5.6350 3.3846 6.0241 9.1041 23.5507 60.0414 6.5090 18.1411 2.4571 50.4040 16.7697 14.0415 0.0024 2.0979 61.2889 81.9899 37.7549 23.1696 29.1314 18.7637 61.5468 60.4038 40.3477 81.3075 8.9989 16.1297 2.0874 196.5042 4.0465 0.5082 35.8610 14.6277 16.1974 51.1004 29.9118 45.1318 52.7622 294.6728 382.7160 63.1226 0.7602 25.5200 7.9848 0.1623 12.5649 0.7828 142.1713
temp: 298.150 k
press: 1.00000 atm
elementType: 16 8 8 8 8 7 7 6 6 6 6 6 6 1 1 1 1 1 1 1 1
symmnumber: 1
zpe: 378084.6 jmol-1
zpe.correction: 0.144005 hartree
zpe.thermalcorrener: 0.158141 hartree
zpe.thermalcorrenthalpy: 0.159086 hartree
zpe.thermalcorrgfe: 0.102075 hartree
zpe.sumelectzpe: -1040.721599 hartree
zpe.sumelectthermal: -1040.707463 hartree
zpe.sumelectthermalent: -1040.706518 hartree
zpe.sumelectthermalfe: -1040.763529 hartree
dipole: -2.0218 -2.5069 -2.8377
dipole: 4.2924
quadrupole: -76.6298 -93.0664 -84.8009
quadrupole: -2.9933 -17.0178 3.6537
quadrupole: 8.2026 -8.2340 0.0315 -2.9933 -17.0178 3.6537
hfenergy: -1040.8656039 hartree
pointgroup: C01 [X(C6H8N2O4S1)]
dipole: -0.7644886 -1.2245962 -0.8762546 debye
dipolederiv: 1.8446361 0.0310214 0.0370661 0.1080754 1.1822376 0.0489521 0.0164229 0.0140871 1.2766585 -1.9208208 0.1045915 0.0532003 -0.0954066 -0.2608596 -0.0104403 -0.2265748 -0.0212984 -0.311096 -0.7378892 0.0411796 -0.0037516 -0.1102315 -0.6799512 0.0010757 0.0819452 0.1209215 -0.538497 -0.7509144 -0.0098761 -0.0538268 0.0549435 -0.459737 0.0483185 -0.1632774 -0.0441602 -0.6347489 -0.8251502 0.2977503 -0.1046974 0.5562759 -0.9238899 0.2164019 -0.1926004 0.2035557 -0.4155514 -0.9371677 0.416065 -0.1600233 -0.5096019 -0.4425726 0.0526549 0.0412459 0.0804649 -0.198666 -0.6056986 0.0931054 -0.0444403 -0.5868622 -0.5526794 0.0729292 0.0844792 0.0855687 -0.1718315 0.1827536 -0.080617 0.0368752 0.5759851 0.488378 -0.1280732 -0.0862866 -0.1401015 -0.1096145 -0.2337249 -0.0060307 -0.0097524 -0.0025372 -0.1658112 -0.0538229 0.022804 -0.0453121 -0.1514878 1.025333 -0.5105155 0.2197512 -0.7907846 1.0526317 -0.2994787 0.2340179 -0.2863396 0.3272816 1.5392715 0.0431976 0.0062148 0.4976708 -0.4276027 0.0986064 0.1202166 0.1154446 0.0870552 -0.0161994 -0.1762367 0.0967946 0.5127906 0.3713096 -0.0897564 -0.0328067 -0.1263252 -0.0607108 0.8270764 -0.1201614 -0.0719337 -0.4286837 0.2683532 0.0704247 -0.0130487 0.0576283 0.2963468 0.3990778 -0.0273648 0.0010567 0.1037041 0.2487902 0.0151459 -0.0270557 0.0275756 0.2919952 0.0737669 0.0454233 -0.0267203 0.0559939 0.0584591 -0.0131829 -0.0489053 -0.0018889 -0.0172349 -0.0117609 -0.0165422 0.0027202 0.0256432 0.1024964 -0.0291678 0.0415297 -0.0301618 0.0928249 0.1160688 -0.0135615 0.0385771 -0.0291199 0.0102404 0.0087423 0.0428877 -0.0012956 0.0577788 0.0365609 -0.0432667 0.0024095 -0.0906017 0.0218539 0.0302142 0.0148858 0.0351989 0.1521177 -0.1243625 -0.0550077 -0.0036861 -0.1223041 0.0453951 -0.0252975 0.0086118 -0.0246144 0.1181666 0.1292206 -0.0180153 0.0376374 0.1260572 0.0170897 0.0541814 0.0210027 0.0632514 0.0296666 -0.010077 0.0048617 -0.0534712 0.1489939 0.0458687 -0.0684273 0.0605062 -0.0821991 -0.1204533 unknown
polarizability: 188.7143437|-7.4525303|112.9689774|4.1906107|-10.873366|79.4360791 unknown
InChI: InChI=1S/C6H8N2O4S/c1-12-4-3-7-6(8-5(4)9)13(2,10)11/h3,8H,1-2H3
charge 0 multiplicity 1
21 atoms
S  2.781044 0.028975 0.482702
O  -3.150266 -1.098237 0.257458
O  2.775709 1.54632 -0.162279
O  3.393405 -0.268814 1.958916
O  -1.990709 1.584002 -0.408399
N  0.116917 0.667843 0.065034
N  0.463501 -1.61875 0.65919
C  0.887421 -0.414504 0.391999
C  3.569813 -1.193657 -0.753686
C  -1.310234 0.585685 -0.038448
C  -1.811882 -0.769602 0.313087
C  -0.919186 -1.799986 0.621446
C  -4.200494 -0.073123 0.508103
H  0.598352 1.558703 -0.162929
H  3.142305 -0.965221 -1.739162
H  4.648862 -0.9914 -0.705416
H  3.311451 -2.198946 -0.394175
H  -1.29524 -2.801004 0.844209
H  -5.141256 -0.631234 0.398757
H  -4.127292 0.749697 -0.216961
H  -4.103923 0.318951 1.536154
