program: Gaussian 09
title: 000244797
version: EM64L-G09RevD.01
frameworkgroup: C1[X(C8H10N2O4)]
method: RPBEPBE
basis: SDD
operation: Freq
keyword: #p
keyword: freq=noraman
keyword: PBEPBE/SDD
title: #p freq=noraman PBEPBE/SDD
converged: YES YES NO NO
title: Mulliken charges:
elementType: O O O O N N C C C C C C C C H H H H H H H H H H
charge: -0.274957 -0.178640 -0.235875 -0.209849 -0.441817 -0.649690 -0.367056 -0.249864 -0.299560 0.247921 0.268297 -0.043191 0.292870 -0.522229 0.240429 0.228069 0.284813 0.249069 0.314247 0.229465 0.222211 0.232980 0.352470 0.309884
chargesum: 0.00000
title: Mulliken charges with hydrogens summed into heavy atoms:
elementType: O O O O N N C C C C C C C C
charge: -0.274957 -0.178640 -0.235875 -0.209849 -0.127569 0.012664 0.101442 0.034950 -0.050491 0.247921 0.268297 0.186274 0.292870 -0.067037
polarizability: 1.76428775e+02 5.79769413e+00 1.16264423e+02 3.78134632e+00 -8.97714927e+00 7.28396339e+01
1716.lowfreq: -11.2534 -6.1248 -0.0007 -0.0006 -0.0004 3.4014 5.8752 25.9474 34.8781
frequency: -11.0026 25.7438 34.8565 46.2065 66.6248 87.9726 102.1606 144.8004 171.1105 198.3603 206.5568 278.1216 330.1817 356.2715 369.5750 398.5472 424.6075 459.8804 527.1483 548.7405 608.0983 619.4976 637.7035 670.2342 693.9104 715.3871 742.2635 848.2044 874.1154 902.5506 911.6868 951.8751 966.3850 974.4343 995.5932 999.7547 1001.5963 1052.1805 1120.0229 1160.9971 1201.7195 1248.1791 1250.5712 1285.3690 1288.5224 1300.2764 1341.8989 1425.9111 1441.5891 1454.3309 1610.3017 1613.0279 1625.4682 1646.2582 1659.1361 1696.7861 3034.9074 3094.7601 3104.5728 3122.9865 3138.0628 3150.8055 3207.1393 3521.6543 3532.7013 3685.4288
redmass: 5.5859 5.0345 5.0823 4.8933 4.9023 3.2840 3.9315 5.3946 2.3651 6.4820 8.3472 5.6020 4.6062 1.5000 2.0741 2.5189 2.5239 6.8286 3.1690 1.1674 2.3725 1.5656 3.1875 2.7259 4.0724 7.9334 8.8010 5.1598 3.3305 2.7414 1.7075 3.1948 2.0211 1.4015 1.1825 2.4462 1.4398 2.0187 2.9586 2.0629 2.7479 1.1753 1.3722 1.3835 1.4494 2.9367 1.2662 1.1557 2.1530 1.1345 1.6950 2.4098 10.8998 5.8160 4.6055 6.2043 1.0571 1.0627 1.1004 1.1002 1.0948 1.0887 1.1153 1.0715 1.0506 1.1040
irintensity: 13.1420 0.4735 0.1744 1.7130 1.7571 1.1817 7.4705 4.4500 1.2135 0.8287 0.3077 14.9788 12.1892 49.4029 13.6210 7.9891 3.8029 17.5355 36.7902 246.4234 38.9302 47.6791 5.3169 12.3785 1.2751 12.0353 52.3047 35.1053 29.9435 6.5614 1.7473 104.4310 90.5105 36.1976 73.1948 19.7413 12.8069 17.9040 285.0917 3.3332 315.9676 3.3709 104.2730 61.2304 62.8848 83.8688 15.2540 12.2431 750.7061 11.1049 95.1531 46.6229 104.0580 12.2117 0.4099 367.3189 33.1460 4.4557 4.8598 14.4401 10.2779 0.4985 19.8666 8.8953 42.3090 38.1720
temp: 298.150 k
press: 1.00000 atm
elementType: 8 8 8 8 7 7 6 6 6 6 6 6 6 6 1 1 1 1 1 1 1 1 1 1
symmnumber: 1
zpe: 465983.3 jmol-1
zpe.correction: 0.177484 hartree
zpe.thermalcorrener: 0.191903 hartree
zpe.thermalcorrenthalpy: 0.192848 hartree
zpe.thermalcorrgfe: 0.133541 hartree
zpe.sumelectzpe: -720.178770 hartree
zpe.sumelectthermal: -720.164350 hartree
zpe.sumelectthermalent: -720.163406 hartree
zpe.sumelectthermalfe: -720.222713 hartree
dipole: 4.3885 7.5264 -0.3178
dipole: 8.7182
quadrupole: -92.7626 -77.8904 -80.3959
quadrupole: -18.3818 0.6519 -0.1558
quadrupole: -9.0797 5.7926 3.2871 -18.3818 0.6519 -0.1558
hfenergy: -720.3562536 hartree
pointgroup: C01 [X(C8H10N2O4)]
dipole: -1.4020319 2.2179493 -2.2090403 debye
dipolederiv: -1.3036512 0.3506881 -0.3190858 0.7026658 -0.8574222 0.2943567 -0.308232 0.1233723 -0.4587929 -0.6300086 0.1667644 -0.167718 -0.0350891 -0.5092678 0.2803228 0.2252526 0.2395776 -0.6931509 -0.8081778 -0.1345096 0.0949926 0.0382373 -0.6778213 0.2276225 0.0322909 0.1693939 -0.4056836 -0.9780013 0.1709818 -0.1078777 0.1150139 -0.5570909 0.1905489 -0.1061118 0.1560118 -0.4684353 -1.6478695 -0.3195329 0.625342 -0.4016094 -0.5683418 0.2728878 0.6968524 0.2444594 -0.6958507 -0.4948416 -0.2406468 0.1444719 -0.3307671 -0.8565292 0.1962189 0.2473087 0.2036455 -1.0463861 0.9536499 -0.1970275 0.2335647 -0.1144281 0.3088366 0.0074687 0.1173119 0.1704842 0.3151106 -0.2401784 0.0307905 -0.0136169 -0.1295102 0.0827894 -0.0668903 0.0783878 -0.0985244 -0.0845676 -0.599942 0.1460035 -0.0549306 0.3182709 -0.0353648 -0.0200039 -0.0074957 -0.0556119 -0.1456928 1.4207387 -0.0816742 -0.08795 0.4533028 0.6333863 -0.6223449 -0.8517238 -0.4748784 1.1074213 1.7382595 -0.2721709 0.0667591 -0.6886067 1.1485278 -0.5233135 0.200699 -0.3556728 0.4590369 -0.2632624 0.1915237 -0.0023371 0.0960545 -0.090616 -0.1121538 0.0928504 -0.1605453 0.0990891 2.1710018 0.1936501 -0.4029359 0.1522287 1.0418944 -0.6689946 -0.2283072 -0.6430602 0.9860158 -0.2931917 0.1283386 0.0315602 0.1567293 -0.1011329 -0.0458974 -0.0291692 -0.0291356 0.0671456 -0.0208678 0.0179518 0.0083033 -0.0876676 0.0674038 0.0993107 0.0266782 0.0201219 -0.0188541 -0.0199266 0.0032056 -0.0536577 0.0611974 -0.1059997 -0.0626117 -0.0371182 -0.0425157 0.0733696 0.0601139 -0.0298146 0.0149814 -0.0627987 0.0873607 0.0441077 -0.0066488 0.0572359 0.1411109 0.0358245 -0.0524545 0.0339179 -0.1132724 0.0219462 0.0627512 0.0447186 0.0768193 0.1291413 0.1269637 0.017409 -0.0260013 -0.0005494 0.2251402 0.1185628 -0.0812643 0.0968108 0.1770885 0.1465861 -0.0777907 0.0430609 -0.0833736 0.0387792 0.0796867 -0.0207831 0.0646723 -0.0753509 0.1323085 -0.0674471 -0.0724425 -0.0936965 0.1180839 -0.0435385 -0.0976259 -0.0403093 -0.0692061 0.1684726 -0.0483709 0.010466 -0.0518753 0.0722937 0.0663006 0.0280107 0.0859947 -0.0337952 0.2044412 0.0378422 -0.0085192 0.0237949 0.277542 0.100986 0.0033462 0.0998614 0.312865 0.1415585 0.0662903 0.0096528 0.0757484 0.2356023 0.1246166 -0.0192275 0.0917923 0.3283715 unknown
polarizability: 174.7942881|-7.5983023|101.7245864|8.6278391|-23.6471577|89.0139568 unknown
InChI: InChI=1S/C8H10N2O4/c1-2-5-14-7(12)4-3-6(11)10-8(9)13/h2-4,10H,1,5,9H2
charge 0 multiplicity 1
24 atoms
O  -2.328163 0.943272 0.292926
O  2.590304 -1.934046 1.920962
O  -2.457545 -1.228694 1.175115
O  4.892441 -1.063227 0.341407
N  2.589766 -0.54607 -0.000023
N  4.266997 0.562425 -1.206372
C  -3.833707 1.024717 0.284777
C  0.475247 -1.259149 1.018973
C  -0.299109 -0.208636 0.626901
C  1.976933 -1.290467 1.032085
C  -1.780844 -0.266438 0.742551
C  -4.375722 0.554757 -1.042079
C  3.998899 -0.400343 -0.23228
C  -5.173893 -0.532898 -1.178787
H  -4.225405 0.420462 1.120249
H  -4.022848 2.097183 0.455774
H  -0.002928 -2.142339 1.460412
H  0.112572 0.734035 0.247339
H  1.957294 -0.144485 -0.696707
H  -4.092352 1.151126 -1.920284
H  -5.564347 -0.837342 -2.156337
H  -5.450333 -1.15196 -0.317154
H  5.244893 0.691991 -1.457836
H  3.57795 1.219326 -1.568012
