program: Gaussian 09
title: 000244796
version: EM64L-G09RevD.01
frameworkgroup: C1[X(C7H9ClN2O4)]
method: RPBEPBE
basis: SDD
operation: Freq
keyword: #p
keyword: freq=noraman
keyword: PBEPBE/SDD
title: #p freq=noraman PBEPBE/SDD
converged: YES YES NO NO
title: Mulliken charges:
elementType: Cl O O O O N N C C C C C C C H H H H H H H H H
charge: -0.046210 -0.277750 -0.226375 -0.176672 -0.206217 -0.444649 -0.644965 -0.248928 -0.572075 0.252236 -0.303648 -0.242214 0.247546 0.290538 0.251502 0.256866 0.273397 0.297403 0.251911 0.285780 0.317395 0.353331 0.311797
chargesum: 0.00000
title: Mulliken charges with hydrogens summed into heavy atoms:
elementType: Cl O O O O N N C C C C C C C
charge: -0.046210 -0.277750 -0.226375 -0.176672 -0.206217 -0.127254 0.020163 0.259440 -0.001274 0.252236 -0.051737 0.043565 0.247546 0.290538
polarizability: 1.95916871e+02 -7.51837926e+00 1.09069822e+02 -6.92667280e+00 7.11487508e+00 6.20928436e+01
1716.lowfreq: -5.5240 -0.0001 0.0019 0.0027 2.3150 6.6270 15.3206 27.3564 35.4325
frequency: 14.7701 27.3509 35.3882 44.3668 71.9674 75.9266 94.9435 148.3906 157.1617 191.9653 196.5287 238.4210 289.7110 312.1336 368.4026 396.9415 440.4688 461.0802 534.9089 556.7816 603.5023 614.3842 653.3240 688.7805 702.2507 712.6562 739.9779 800.6436 859.2110 880.9621 902.9188 963.0562 994.8895 997.9300 1030.6368 1054.1740 1068.2247 1120.1534 1187.6330 1201.8966 1251.5667 1264.7526 1283.0007 1288.1624 1301.0916 1362.9689 1438.5038 1455.3710 1462.0462 1607.8308 1612.5627 1629.4100 1644.1910 1697.5457 3049.1003 3072.7395 3129.9872 3140.6074 3149.5574 3163.8506 3520.7260 3531.1484 3683.1051
redmass: 5.9022 8.2982 7.7801 6.8450 5.2580 3.0787 5.8365 5.9035 2.7907 7.4406 6.1819 6.8130 4.4667 6.2579 2.0715 1.7773 4.5050 7.0853 3.7554 1.1839 1.5257 2.4664 5.1389 4.4124 5.7620 7.7188 8.2980 1.1880 4.8724 3.8272 2.8441 5.6658 1.2483 3.2996 1.3105 2.0076 4.2498 3.1127 1.3142 2.6454 1.3702 1.1723 1.1240 1.7365 2.8667 1.2691 2.1473 1.0959 1.0960 1.8205 2.2219 10.8880 5.8579 6.2833 1.0592 1.0557 1.1084 1.0960 1.0877 1.1127 1.0719 1.0501 1.1040
irintensity: 13.9041 1.2148 0.8023 2.1789 1.6163 1.9771 5.3694 5.9261 2.8341 1.2633 0.8037 4.1740 19.0874 13.0795 26.8317 55.4175 13.9242 22.2692 21.3915 245.4240 73.7687 10.6104 1.5932 5.7456 54.9212 10.6439 54.7806 5.3279 7.8105 22.5503 8.6393 98.7911 80.6941 12.8118 8.0937 17.1378 1.4882 343.2305 12.3380 305.5226 105.9202 2.5005 8.5536 131.7406 83.3572 15.4236 735.7633 3.2663 14.1242 99.1062 46.3619 121.5811 23.7987 360.6499 11.0257 15.2272 1.9464 8.8543 0.9652 7.8683 8.6480 45.9229 38.6271
temp: 298.150 k
press: 1.00000 atm
elementType: 17 8 8 8 8 7 7 6 6 6 6 6 6 6 1 1 1 1 1 1 1 1 1
symmnumber: 1
zpe: 431700.2 jmol-1
zpe.correction: 0.164426 hartree
zpe.thermalcorrener: 0.179902 hartree
zpe.thermalcorrenthalpy: 0.180846 hartree
zpe.thermalcorrgfe: 0.117194 hartree
zpe.sumelectzpe: -1141.546590 hartree
zpe.sumelectthermal: -1141.531114 hartree
zpe.sumelectthermalent: -1141.530170 hartree
zpe.sumelectthermalfe: -1141.593822 hartree
dipole: -1.7821 7.2196 0.7356
dipole: 7.4726
quadrupole: -125.0783 -84.8467 -87.2330
quadrupole: 23.3446 -0.4670 0.8928
quadrupole: -26.0256 14.2060 11.8196 23.3446 -0.4670 0.8928
hfenergy: -1141.7110159 hartree
pointgroup: C01 [X(C7H9Cl1N2O4)]
dipole: 0.4241084 -2.5399124 -1.4185514 debye
dipolederiv: -0.6589569 0.0569093 0.1087353 0.019506 -0.1553165 0.0055393 0.0976172 -0.0119881 -0.209118 -1.4488521 0.4618302 0.2219746 0.6860785 -0.8559956 -0.1449347 0.3125442 -0.1193633 -0.3872717 -0.8340958 -0.1704662 -0.0156061 -0.016121 -0.79326 -0.117509 0.0403122 -0.0882133 -0.3304386 -0.6361195 0.1851591 0.1561582 -0.1256608 -0.611476 -0.2698192 -0.1964531 -0.2821082 -0.56783 -0.9892685 0.1739099 0.0708235 0.1035286 -0.6467672 -0.1311912 0.0886566 -0.0892448 -0.3610881 -1.5916961 -0.5263905 -0.4629209 -0.6360966 -0.7916717 -0.2794696 -0.5221214 -0.2586891 -0.5179603 -0.462632 -0.2434889 -0.0443444 -0.3686091 -1.0204386 -0.2164449 -0.1201533 -0.2415573 -0.9068691 0.7926501 -0.2106487 -0.1060527 -0.0282736 0.2347674 0.0116367 -0.1576622 -0.0232791 0.2753677 0.7140287 -0.0299248 -0.0639245 -0.0111104 0.1449873 0.0247688 -0.1089958 0.0889907 0.1274708 1.9617721 -0.2732673 -0.1120431 -0.626655 1.3111758 0.2799589 -0.2009658 0.2050523 0.3191714 -0.7378197 0.1177014 0.0459473 0.2877752 -0.0087382 -0.0089969 -0.045362 0.0201551 -0.1637764 -0.1402479 -0.0029874 -0.0023806 -0.2385295 0.1153227 0.0293613 -0.0443084 0.0475467 -0.1045157 1.353557 0.0162309 0.0156767 0.7542026 0.9439704 0.6462733 0.656642 0.574759 0.8092219 2.1393025 0.3461312 0.2579536 0.3000487 1.480597 0.535365 0.086538 0.492475 0.5696159 -0.0033809 0.0489291 0.0054113 0.0476099 -0.0475059 0.062396 0.0183968 0.0376334 0.0773644 -0.0097929 0.0282321 0.0002227 -0.0683799 0.0541228 -0.0870427 -0.0002268 -0.0476448 -0.0065564 -0.0374444 -0.0392573 -0.0537872 -0.0308661 0.0347083 -0.0865197 -0.007417 -0.0598698 -0.012408 -0.0027397 0.0494408 -0.0208252 0.0273629 -0.0248427 0.0571068 -0.006858 0.0185261 0.0830052 0.0530147 -0.0557404 -0.0096473 -0.111918 -0.0164627 -0.027362 -0.0072558 -0.0404422 0.1582796 0.0705611 -0.0344039 0.002258 -0.0627291 0.0633731 -0.0237284 0.0260357 -0.0351251 0.1600097 0.1283337 0.012719 0.0324898 0.0037006 0.1770911 -0.1184355 0.0983564 -0.0860373 0.2306273 0.2034088 0.037355 0.0031258 0.0202724 0.2239087 -0.0683082 -0.0047737 -0.068765 0.3699253 0.1364177 0.0520276 -0.0292449 0.0748639 0.1884505 -0.0726441 -0.0025457 -0.0328111 0.3877731 unknown
polarizability: 193.8308995|-14.1669759|102.1537223|-8.1275107|20.6350838|71.0949146 unknown
InChI: InChI=1S/C7H9ClN2O4/c8-3-4-14-6(12)2-1-5(11)10-7(9)13/h1-2,10H,3-4,9H2
charge 0 multiplicity 1
23 atoms
Cl 6.292404 -0.111261 -0.988472
O  2.407281 -0.434511 0.350134
O  2.322972 1.877342 0.733666
O  -2.744622 2.210969 1.600564
O  -4.994583 0.896831 0.26127
N  -2.665371 0.43832 0.032025
N  -4.274084 -1.088982 -0.726324
C  3.898865 -0.376542 0.377763
C  4.413019 0.027777 -1.005792
C  1.735813 0.783905 0.562877
C  0.270536 0.548262 0.545336
C  -0.605411 1.575457 0.734008
C  -2.099779 1.452551 0.832505
C  -4.066428 0.140499 -0.101986
H  4.209081 -1.398612 0.641042
H  4.226121 0.344248 1.145953
H  4.062953 -0.653933 -1.793842
H  4.183119 1.074667 -1.246797
H  -0.042571 -0.493858 0.413387
H  -0.218553 2.582123 0.9361
H  -2.022954 -0.060322 -0.588994
H  -5.24166 -1.347659 -0.909919
H  -3.549146 -1.794472 -0.845103
