program: Gaussian 09
title: 000244794
version: EM64L-G09RevD.01
frameworkgroup: C1[X(C6H5Br2NO2)]
method: RPBEPBE
basis: SDD
operation: Freq
keyword: #p
keyword: freq=noraman
keyword: PBEPBE/SDD
title: #p freq=noraman PBEPBE/SDD
converged: YES YES NO NO
title: Mulliken charges:
elementType: Br Br O O N C C C C C C H H H H H
charge: 0.083504 0.078965 -0.175938 -0.198051 -0.218031 -0.315313 0.202955 0.211218 -0.699392 -0.240913 -0.247634 0.281307 0.294059 0.385120 0.279087 0.279057
chargesum: 0.00000
title: Mulliken charges with hydrogens summed into heavy atoms:
elementType: Br Br O O N C C C C C C
charge: 0.083504 0.078965 -0.175938 -0.198051 -0.218031 0.260053 0.202955 0.211218 -0.314272 0.038175 0.031422
polarizability: 1.24922635e+02 -1.76965722e+01 9.94365459e+01 6.89960464e+00 1.32359749e+01 8.88862568e+01
1716.lowfreq: -7.4326 -6.4167 -0.0003 0.0001 0.0006 5.1472 27.4773 48.6681 70.3186
frequency: 27.4160 48.6533 70.3129 123.5022 144.9596 177.1805 227.2220 266.1988 294.2972 353.8101 391.9454 531.1616 549.6119 585.4928 618.0667 653.8441 688.5341 736.6193 755.1444 823.3252 906.3116 942.1573 992.8988 1028.8379 1062.3127 1105.1360 1135.1520 1175.1458 1238.3043 1284.8173 1301.1433 1351.2743 1378.7740 1440.5721 1578.7013 1626.8250 1678.8706 3012.3740 3089.5786 3136.1590 3207.6737 3235.3200
redmass: 15.8392 9.0485 7.9250 10.5692 20.8434 20.9469 8.8215 3.2746 4.2477 4.2629 6.1538 4.4329 4.1937 10.2529 2.5419 5.4924 8.1574 6.9712 4.8111 2.0209 2.2183 1.3150 2.8020 1.6989 2.9317 2.6975 2.4118 1.0791 1.4944 1.6836 1.3710 2.2106 1.8524 1.1020 6.9014 11.3918 11.0123 1.0614 1.1015 1.0890 1.0898 1.1105
irintensity: 0.0466 0.7135 0.0903 9.6992 0.4872 0.6376 1.2915 3.3653 0.0010 22.8596 24.9415 40.0374 0.7578 45.8346 6.1755 35.9783 34.2103 0.1463 12.2164 81.0750 36.6432 0.0220 10.7244 22.9886 3.6830 52.8096 0.1783 31.2691 5.9131 1.4637 76.5187 116.0911 128.1569 34.6645 8.2677 431.0298 7.5560 8.1445 0.7979 2.0626 0.1053 0.2891
temp: 298.150 k
press: 1.00000 atm
elementType: 35 35 8 8 7 6 6 6 6 6 6 1 1 1 1 1
symmnumber: 1
zpe: 269014.1 jmol-1
zpe.correction: 0.102462 hartree
zpe.thermalcorrener: 0.113390 hartree
zpe.thermalcorrenthalpy: 0.114334 hartree
zpe.thermalcorrgfe: 0.062144 hartree
zpe.sumelectzpe: -462.943636 hartree
zpe.sumelectthermal: -462.932708 hartree
zpe.sumelectthermalent: -462.931764 hartree
zpe.sumelectthermalfe: -462.983955 hartree
dipole: -3.1299 -0.9039 -0.3128
dipole: 3.2728
quadrupole: -68.3028 -86.6547 -88.9506
quadrupole: -0.4887 4.0186 -6.5386
quadrupole: 12.9999 -5.3520 -7.6479 -0.4887 4.0186 -6.5386
hfenergy: -463.0460981 hartree
pointgroup: C01 [X(C6H5Br2N1O2)]
dipole: -1.2334034 0.3380128 -0.1497378 debye
dipolederiv: -0.6550427 -0.0734324 0.2717141 -0.0090742 -0.0449904 -0.0059054 0.2526546 0.0353087 -0.2636273 -0.1226238 -0.0488472 0.0972448 -0.0632896 -0.1387663 0.2612299 0.0631595 0.1770398 -0.5898633 -0.4330022 0.142169 0.0384954 -0.2350978 -0.9627402 -0.0723465 -0.0010497 -0.136756 -0.3205708 -0.520976 -0.2974575 -0.0001962 0.0533183 -0.9521984 -0.0253208 0.022534 0.0561614 -0.3201352 -1.3014845 -0.0460775 0.1238287 -0.0555057 -1.099743 -0.100058 0.1521239 -0.0770778 -0.2609001 0.6494645 -0.0771578 0.018382 -0.0096392 0.0212461 0.0812885 0.012702 0.0234214 0.0359766 0.950329 0.0716708 -0.1188604 0.5815185 1.3468278 0.0981188 -0.154027 0.0985972 0.2997312 0.8781106 0.1149205 -0.1075995 -0.3193722 1.4164676 0.0908761 -0.1847889 0.0562682 0.2902555 0.8467265 0.1189213 -0.4163119 0.0600305 0.1553407 -0.3577998 -0.3913856 -0.3356362 1.009616 -0.1597641 0.2450152 -0.0049133 0.1987134 -0.0567211 -0.0496791 0.0271489 -0.0788271 -0.1285262 -0.2693284 -0.2123111 -0.0146736 -0.1692951 0.0184009 0.0574362 0.0388178 0.0822111 -0.1208764 -0.0281921 0.027015 -0.0349365 -0.047665 0.0777902 0.0646373 0.0221027 0.0506313 -0.0329452 0.0840799 -0.0238645 -0.0044659 0.0527374 0.0279884 -0.041157 0.0136763 -0.0020348 0.1254265 0.0001398 0.0526175 0.0728947 -0.0447214 0.0322944 0.0177896 0.028051 0.0697888 -0.0568425 0.02914 -0.0243943 0.0403889 -0.0477404 0.0898229 0.0082886 0.049448 0.0008275 0.1680483 0.0524237 0.0312131 0.0390088 0.0550826 0.0689804 -0.0273984 0.0488326 -0.0199235 0.1652329 unknown
polarizability: 123.9387933|6.1142819|106.4829255|-19.165032|-6.9790547|82.8237188 unknown
InChI: InChI=1S/C6H5Br2NO2/c7-4(8)3-9-5(10)1-2-6(9)11/h1-2,4H,3H2
charge 0 multiplicity 1
16 atoms
Br 3.900802 0.109434 -0.662407
Br 1.945887 -0.754938 1.884254
O  -1.030484 -2.307231 -0.393826
O  -0.394043 2.340391 -0.157446
N  -0.341898 -0.025601 -0.379465
C  1.030042 -0.190214 -0.859101
C  -1.267243 -1.095761 -0.184556
C  -0.955309 1.219334 -0.076095
C  2.075094 0.282463 0.167968
C  -2.544723 -0.450764 0.289382
C  -2.364377 0.897498 0.348412
H  1.178004 0.404992 -1.779786
H  1.172915 -1.258546 -1.095949
H  1.966441 1.340438 0.441088
H  -3.431249 -1.03947 0.525009
H  -3.06756 1.675575 0.645119
