program: Gaussian 09
title: 000244786
version: EM64L-G09RevD.01
frameworkgroup: C1[X(C18H20O3)]
method: RPBEPBE
basis: SDD
operation: Freq
keyword: #pfreq=noraman
keyword: PBEPBE/SDD
title: #p freq=noraman PBEPBE/SDD
converged: YES YES NO NO
title: Mulliken charges:
elementType: O O O C C C C C C C C C C C C C C C C C C H H H H H H H H H H H H H H H H H H H H
charge: -0.261523 -0.262789 -0.258231 -0.192179 -0.481139 -0.563357 0.520609 0.504736 -0.393432 -0.397238 -0.416957 -0.402137 -0.359213 -0.366402 0.316563 0.305135 -0.226048 -0.230792 -0.243548 -0.757678 -0.537779 0.246177 0.232243 0.235887 0.230631 0.208437 0.260244 0.233752 0.231629 0.231521 0.251953 0.239382 0.222564 0.223337 0.227053 0.249246 0.246732 0.243398 0.246830 0.220814 0.221570
chargesum: 0.00000
title: Mulliken charges with hydrogens summed into heavy atoms:
elementType: O O O C C C C C C C C C C C C C C C C C C
charge: -0.261523 -0.262789 -0.258231 0.053998 -0.013009 -0.124290 0.520609 0.504736 -0.133188 -0.163486 -0.185327 -0.170616 -0.107260 -0.127020 0.316563 0.305135 -0.003484 -0.007456 -0.016495 -0.018302 0.151435
polarizability: 2.40496570e+02 2.00235181e+01 2.15210601e+02 -1.61468223e+01 2.57090029e+01 1.51457253e+02
1716.lowfreq: -14.7064 -4.5648 0.0002 0.0004 0.0008 4.1174 15.6270 20.7578 26.3271
frequency: 14.7344 20.5825 26.3185 35.9732 48.2679 50.4518 60.9405 71.6884 89.8446 111.8303 145.7965 171.3923 210.8609 220.1695 231.4281 259.3506 271.7813 302.7570 340.2639 348.8001 403.8549 414.9765 416.8117 463.3953 486.4297 515.6586 530.3006 548.8897 565.6239 582.5790 617.6824 630.3855 634.7003 702.0188 706.1887 740.0741 759.2908 784.2502 801.2923 813.8786 820.6595 830.3558 853.5878 858.8765 896.4948 918.0363 947.2131 968.3159 975.3264 986.0773 990.0655 992.0623 993.0808 997.3415 1009.5145 1025.7745 1035.8779 1042.0375 1066.3804 1092.0768 1111.4092 1114.9051 1155.2957 1161.9282 1171.6430 1179.4783 1186.7765 1200.7239 1211.7769 1218.2015 1233.9529 1264.2479 1269.0989 1303.0956 1311.2176 1327.8438 1340.2161 1343.5465 1381.1632 1382.4122 1398.0428 1423.3594 1436.4623 1440.0618 1452.8282 1455.7241 1467.1840 1471.9070 1475.9186 1484.5142 1491.1261 1503.1294 1582.7658 1593.0646 1614.5094 1621.3298 1640.2026 2960.0043 2983.7191 3003.8251 3005.1673 3023.6170 3040.3681 3047.8449 3068.4227 3098.6385 3113.4244 3113.6613 3126.1137 3130.0505 3130.7311 3139.5886 3142.1557 3142.4938 3160.5484 3161.4139 3170.1808
redmass: 4.2852 4.3240 3.5558 5.4559 3.3836 2.1839 1.7240 2.8468 3.5110 5.0790 4.4670 3.5317 2.2410 4.3282 1.8804 2.8019 3.2488 3.7675 3.0541 3.6239 2.8203 2.9446 4.2063 4.1324 3.5252 3.5680 3.3813 3.0499 3.9733 3.9071 6.3624 6.8680 4.1075 2.6585 1.7805 3.7857 2.1015 2.2586 3.2899 1.4576 2.2035 1.8183 1.2570 2.8242 5.6359 1.5155 1.4123 1.3767 1.3876 6.8495 6.2459 1.8601 1.3176 2.7150 1.8512 2.3546 3.5497 1.6665 1.9063 1.7778 1.2602 1.3408 1.3622 1.3574 1.0526 1.3077 1.1183 3.0463 2.0600 2.4377 3.3600 1.2840 1.2371 1.3809 1.3079 1.2614 2.0247 1.4640 1.2518 7.3831 3.3736 2.5505 1.1775 2.1700 1.0595 1.0527 1.0502 1.0717 1.1543 2.1170 1.1020 2.4521 6.8123 6.0347 6.1852 6.2763 9.5809 1.0330 1.0612 1.0608 1.0378 1.0852 1.0981 1.1040 1.1032 1.0948 1.0873 1.0867 1.0985 1.0891 1.0906 1.1022 1.0957 1.0892 1.0945 1.1014 1.0962
irintensity: 0.1261 0.0585 0.9589 0.2798 1.1817 1.5028 0.2978 2.1459 2.1533 3.8156 2.5778 4.1797 4.0291 1.7583 3.2612 2.4357 1.6763 3.5208 0.4142 0.8988 0.0007 0.2351 6.9667 2.4386 6.8023 11.9586 30.9346 10.9962 13.6674 12.1943 0.0481 1.5106 6.5497 3.1002 54.0351 6.2704 25.6931 1.7023 43.9133 21.5672 14.8049 29.5084 0.4817 24.5369 136.6447 4.3861 1.7878 0.7258 0.0187 46.3561 0.2708 81.2128 0.1742 7.6294 2.0248 4.8297 7.4124 8.0110 9.2986 7.1902 0.2232 12.0400 5.7609 37.5550 0.9149 108.0580 1.3327 316.9338 44.4233 2.1466 173.9866 7.9249 0.9070 14.2120 0.7696 0.1915 33.2118 6.4213 52.3727 0.9056 2.1488 4.8343 9.2612 7.8148 21.1042 20.1199 13.6186 48.9442 1.2997 25.3372 14.4470 79.8255 11.6490 1.1089 15.1111 85.0707 169.9479 64.4559 17.7278 22.4614 3.6140 10.9890 2.8878 48.4621 41.8890 9.8401 8.2543 11.5686 32.9737 8.2323 7.8617 10.2994 42.5134 7.7068 13.3592 26.5786 4.0708
temp: 298.150 k
press: 1.00000 atm
elementType: 8 8 8 6 6 6 6 6 6 6 6 6 6 6 6 6 6 6 6 6 6 1 1 1 1 1 1 1 1 1 1 1 1 1 1 1 1 1 1 1 1
symmnumber: 1
zpe: 877064.3 jmol-1
zpe.correction: 0.334056 hartree
zpe.thermalcorrener: 0.354796 hartree
zpe.thermalcorrenthalpy: 0.355740 hartree
zpe.thermalcorrgfe: 0.279895 hartree
zpe.sumelectzpe: -922.048964 hartree
zpe.sumelectthermal: -922.028224 hartree
zpe.sumelectthermalent: -922.027280 hartree
zpe.sumelectthermalfe: -922.103125 hartree
dipole: 0.4034 -1.9702 -2.7600
dipole: 3.4150
quadrupole: -120.0828 -113.3580 -122.8215
quadrupole: 10.2033 8.3523 3.4320
quadrupole: -1.3287 5.3961 -4.0674 10.2033 8.3523 3.4320
hfenergy: -922.38302 hartree
pointgroup: C01 [X(C18H20O3)]
dipole: 0.2050476 0.6886923 1.1352691 debye
polarizability: 236.9888506|-23.1189572|214.9134582|17.436202|28.3185591|155.2621157 unknown
InChI: InChI=1S/C18H20O3/c1-14(19)21-18(13-8-15-6-4-3-5-7-15)16-9-11-17(20-2)12-10-16/h3-7,9-12,18H,8,13H2,1-2H3
charge 0 multiplicity 1
41 atoms
O  -0.872352 -2.452678 0.605888
O  -4.171658 3.007233 -0.169505
O  -2.19606 -3.329264 -1.110516
C  -0.397634 -1.345401 -0.324537
C  1.045348 -1.05984 0.11793
C  1.758435 -0.046944 -0.820471
C  -1.366333 -0.177439 -0.245299
C  3.17764 0.250904 -0.358489
C  -2.315031 0.026536 -1.283183
C  -1.372451 0.71477 0.853613
C  3.450514 1.366386 0.474711
C  4.253855 -0.602362 -0.715936
C  -3.231303 1.091433 -1.232015
C  -2.287328 1.787628 0.92548
C  -3.219483 1.978224 -0.12616
C  -1.803409 -3.353922 0.079379
C  4.760148 1.622682 0.940777
C  5.565071 -0.351016 -0.253344
C  5.823164 0.763162 0.578991
C  -2.264879 -4.322769 1.147715
C  -4.207158 3.947372 0.953411
H  -0.413422 -1.764422 -1.348502
H  1.060802 -0.678092 1.155495
H  1.604673 -2.013811 0.126126
H  1.167063 0.886673 -0.857806
H  1.771052 -0.462495 -1.847712
H  -2.341818 -0.671501 -2.127196
H  -0.661876 0.5728 1.675936
H  2.631239 2.041759 0.752748
H  4.063202 -1.465515 -1.366606
H  -3.964531 1.25386 -2.027584
H  -2.267096 2.457005 1.790679
H  4.952299 2.492317 1.579838
H  6.384315 -1.018729 -0.543983
H  6.839848 0.961448 0.936566
H  -3.058495 -3.845373 1.751301
H  -1.437768 -4.583786 1.826621
H  -2.678767 -5.226499 0.676132
H  -5.015772 4.652344 0.711203
H  -3.250182 4.496423 1.049871
H  -4.436058 3.429902 1.905435
