program: Gaussian 09
title: 000244777
version: EM64L-G09RevD.01
frameworkgroup: C1[X(C16H15ClO)]
method: RPBEPBE
basis: SDD
operation: Freq
keyword: #p
keyword: freq=noraman
keyword: PBEPBE/SDD
title: #p freq=noraman PBEPBE/SDD
converged: YES YES NO NO
title: Mulliken charges:
elementType: Cl O C C C C C C C C C C C C C C C C H H H H H H H H H H H H H H H
charge: -0.066043 -0.263186 -0.628942 0.512792 -0.165440 0.517630 -0.352990 -0.440776 -0.365696 -0.383135 -0.413915 0.318986 -0.202261 -0.215609 -0.360329 -0.369896 -0.110657 -0.536974 0.216018 0.226235 0.233419 0.223875 0.236656 0.250747 0.226887 0.226136 0.249481 0.239932 0.253846 0.253559 0.221756 0.221767 0.246126
chargesum: 0.00000
title: Mulliken charges with hydrogens summed into heavy atoms:
elementType: Cl O C C C C C C C C C C C C C C C C
charge: -0.066043 -0.263186 -0.186689 0.512792 0.067979 0.517630 -0.129114 -0.204120 -0.114949 -0.156248 -0.187779 0.318986 0.051585 0.037950 -0.110847 -0.129964 -0.110657 0.152675
polarizability: 3.32849975e+02 1.64499414e+01 1.51539910e+02 2.29133773e+01 -1.20772666e+00 1.26325889e+02
1716.lowfreq: -9.0981 0.0009 0.0017 0.0019 2.1335 4.2204 19.0050 23.0961 29.0985
frequency: 18.0796 23.0369 29.0931 57.6957 86.5257 108.5490 129.1263 182.1272 185.4862 200.8927 239.5472 245.5845 277.6523 316.8050 362.5820 368.1879 389.6424 409.7514 417.7943 439.2514 463.2169 504.7692 523.4989 574.3177 626.7513 630.6744 634.6585 707.4296 730.2273 733.1495 784.4776 803.0311 816.8447 828.8457 832.7427 837.1822 870.3700 929.8962 941.0060 956.3726 965.0030 970.3158 986.3711 987.0318 999.7923 1000.6104 1070.9757 1080.9445 1105.1728 1112.2033 1114.2277 1156.9442 1177.8056 1180.7849 1182.7716 1200.5733 1221.6936 1239.3864 1265.1651 1294.9872 1298.2766 1313.3968 1327.1241 1375.9281 1382.8038 1396.3529 1427.3596 1436.1037 1452.7863 1466.7962 1472.5045 1476.9502 1502.3529 1574.8075 1586.5631 1599.7131 1621.5636 1662.4844 2958.9860 2959.3368 3008.1957 3047.2230 3069.7455 3097.1530 3120.2831 3126.1363 3126.4350 3136.6091 3138.4536 3161.6461 3166.0143 3167.7172 3169.2289
redmass: 4.5236 4.4355 4.6816 4.5451 6.7059 3.3895 3.0606 4.3139 3.0389 2.9299 2.6792 1.7072 4.0765 4.5742 3.5347 5.7686 3.9077 2.8908 2.9616 4.7912 3.3753 3.0700 2.6924 4.0000 6.6895 5.1035 6.6315 3.4104 3.2696 4.5845 3.3628 1.6174 1.3884 2.0044 1.3240 1.8601 2.2436 1.7446 1.4208 1.5388 1.3550 1.3732 1.1409 8.6859 3.5075 3.0008 2.8385 2.9969 1.3599 1.2601 1.3799 1.3330 1.2661 1.1513 1.1224 2.6048 1.8816 3.5668 1.4364 1.2998 1.3261 1.3362 1.7647 6.4140 3.5467 2.6603 3.7083 1.1723 1.1199 1.0502 1.0736 2.3040 2.5179 6.9429 7.4212 6.2215 6.3042 6.0904 1.0503 1.0416 1.0999 1.1040 1.0901 1.0888 1.0892 1.0993 1.0898 1.0892 1.0877 1.0937 1.0952 1.0962 1.0961
irintensity: 0.5823 0.0519 0.1552 1.1043 0.1565 4.8142 0.2746 1.5060 0.9393 2.3277 3.1928 1.3506 0.7643 0.6717 2.4680 10.1160 3.2618 0.3631 0.0778 2.8735 8.4144 30.6451 12.7052 5.4172 0.8926 29.2648 1.0448 2.6203 3.5425 9.1462 7.5832 25.8073 12.7287 33.0663 17.1429 56.6649 3.4714 21.0819 4.9704 6.6999 3.5594 1.3294 52.4480 53.1486 51.0722 10.2789 32.0661 3.0607 10.9367 0.2203 13.3387 1.1985 108.0975 0.8545 0.4930 2.0722 32.6516 211.7573 2.6012 0.1224 2.4122 5.0464 4.2487 2.1008 3.2759 4.6052 18.0095 9.4878 26.8103 13.9966 59.7311 87.6601 125.2408 10.6597 2.0429 3.2539 89.7166 0.6128 61.5838 56.2306 14.6609 48.8435 18.3553 29.2133 24.2938 20.6537 12.0357 6.8694 9.3880 20.1291 7.9374 6.2565 1.7722
temp: 298.150 k
press: 1.00000 atm
elementType: 17 8 6 6 6 6 6 6 6 6 6 6 6 6 6 6 6 6 1 1 1 1 1 1 1 1 1 1 1 1 1 1 1
symmnumber: 1
zpe: 684004.7 jmol-1
zpe.correction: 0.260524 hartree
zpe.thermalcorrener: 0.277316 hartree
zpe.thermalcorrenthalpy: 0.278260 hartree
zpe.thermalcorrgfe: 0.212871 hartree
zpe.sumelectzpe: -1152.680080 hartree
zpe.sumelectthermal: -1152.663287 hartree
zpe.sumelectthermalent: -1152.662343 hartree
zpe.sumelectthermalfe: -1152.727732 hartree
dipole: -3.4670 1.7019 -1.2366
dipole: 4.0553
quadrupole: -106.4210 -111.6177 -109.6450
quadrupole: 9.6093 13.5425 0.7572
quadrupole: 2.8069 -2.3898 -0.4171 9.6093 13.5425 0.7572
hfenergy: -1152.9406032 hartree
pointgroup: C01 [X(C16H15Cl1O1)]
dipole: 1.3348279 0.625668 0.6101642 debye
polarizability: 331.3426341|-17.0656911|150.5596283|28.7128058|3.5675374|128.8135107 unknown
InChI: InChI=1S/C16H15ClO/c1-18-16-11-7-14(8-12-16)4-2-3-13-5-9-15(17)10-6-13/h2,4-12H,3H2,1H3
charge 0 multiplicity 1
33 atoms
Cl -6.68017 -1.909145 -0.300598
O  5.775113 -1.208136 -0.478985
C  -1.762261 1.81514 0.119041
C  -2.971153 0.884306 -0.009837
C  -0.443326 1.168993 -0.253158
C  1.954829 0.502839 0.295287
C  0.635455 1.097885 0.579508
C  -4.198048 1.358226 -0.538689
C  -2.900089 -0.464816 0.423605
C  2.287155 -0.118883 -0.9468
C  2.960441 0.538464 1.29771
C  4.543443 -0.623861 -0.14885
C  -5.332323 0.51927 -0.630138
C  -4.020943 -1.320579 0.341435
C  3.555662 -0.673046 -1.168336
C  4.243737 -0.013443 1.093273
C  -5.223502 -0.81128 -0.185143
C  6.830283 -1.181637 0.536995
H  -1.937158 2.704225 -0.521212
H  -1.696813 2.19208 1.160306
H  -0.393182 0.744155 -1.266238
H  0.527524 1.532403 1.586262
H  -4.274987 2.395637 -0.886257
H  -1.956225 -0.850864 0.825361
H  1.54311 -0.169635 -1.749149
H  2.733703 1.009951 2.262353
H  3.812048 -1.150365 -2.119191
H  4.987083 0.037389 1.894369
H  -6.275569 0.891946 -1.04016
H  -3.959598 -2.359787 0.677953
H  6.525661 -1.732759 1.448076
H  7.103777 -0.142655 0.805808
H  7.690723 -1.68312 0.070499
