program: Gaussian 09
title: 000244772
version: EM64L-G09RevD.01
frameworkgroup: C1[X(C15H15ClO)]
method: RPBEPBE
basis: SDD
operation: Freq
keyword: #p
keyword: freq=noraman
keyword: PBEPBE/SDD
title: #p freq=noraman PBEPBE/SDD
converged: YES YES NO NO
title: Mulliken charges:
elementType: Cl O C C C C C C C C C C C C C C C H H H H H H H H H H H H H H H
charge: -0.065079 -0.468496 -0.467941 -0.207423 -0.545702 0.440630 0.508945 -0.398570 -0.368731 -0.412962 -0.415246 -0.219972 -0.211742 -0.227221 -0.227517 -0.106389 -0.243906 0.226043 0.225617 0.215897 0.232195 0.219207 0.235004 0.290333 0.233660 0.229419 0.347707 0.254017 0.253696 0.223951 0.223092 0.227483
chargesum: 0.00000
title: Mulliken charges with hydrogens summed into heavy atoms:
elementType: Cl O C C C C C C C C C C C C C C C
charge: -0.065079 -0.120790 -0.016281 0.008475 -0.094300 0.440630 0.508945 -0.163566 -0.078398 -0.179302 -0.185827 0.034046 0.041954 -0.003271 -0.004425 -0.106389 -0.016423
polarizability: 2.21493209e+02 -2.45285283e+01 1.58011991e+02 -1.12014710e+01 -1.92188088e+01 1.22844552e+02
1716.lowfreq: -14.7565 -6.3499 -0.0021 -0.0021 -0.0014 2.3585 13.7667 19.7476 27.9597
frequency: 13.7639 19.5495 27.5138 48.2175 86.7645 108.2917 149.1298 169.8024 251.0992 267.9360 279.7075 288.1820 314.3187 332.7847 397.8614 404.3611 408.3136 441.4084 489.1873 503.7584 533.2117 604.6049 617.6061 624.2587 669.4020 705.7126 723.3230 750.1876 775.1906 788.5361 816.7882 833.6895 852.6435 854.1959 886.3829 919.7523 948.8666 974.9861 978.7976 988.2334 989.8652 993.7843 1000.9019 1023.2989 1025.9896 1068.3777 1071.2390 1084.9326 1109.1732 1145.5708 1153.5445 1171.4788 1181.8801 1185.1187 1217.6438 1218.1762 1241.3322 1273.5788 1293.7515 1305.2936 1325.6197 1357.5900 1373.0099 1381.8899 1387.5685 1394.9084 1439.5918 1461.9965 1478.2824 1481.8758 1483.4445 1588.0609 1592.4570 1602.9628 1613.9953 2930.2547 2972.4524 2997.7113 3025.9450 3061.3820 3112.0730 3114.0868 3124.1673 3130.7619 3142.3428 3161.6376 3161.6973 3169.0019 3185.2099 3576.5998
redmass: 4.0059 5.3704 4.1599 4.3695 4.5585 5.5922 4.4695 6.4990 3.9795 4.3411 1.7381 2.5708 2.8148 2.6862 3.7496 2.8361 2.9875 5.0942 3.7478 3.2549 4.3871 4.2209 6.3596 7.1179 4.7210 1.7820 3.7458 2.2622 2.1263 1.4338 2.0840 1.5339 1.4195 1.5785 2.5101 1.5782 1.3573 1.3960 1.4822 2.1239 5.7894 1.3755 4.0304 2.2810 2.1849 3.5458 2.6778 1.5647 1.3656 1.1843 1.4952 1.0521 1.1435 1.1115 1.9106 1.6309 1.4439 1.1858 1.2535 1.3633 1.2582 1.4413 3.7988 7.8801 3.0945 1.8978 2.1736 1.1195 2.1761 1.2492 2.0446 7.6473 6.0362 6.2612 6.1959 1.0821 1.0639 1.0595 1.0978 1.1035 1.0873 1.0870 1.0896 1.0905 1.0957 1.0948 1.0961 1.0953 1.0957 1.0661
irintensity: 0.0620 0.0297 0.1264 0.3040 0.9958 0.0118 2.9637 1.7560 10.0551 1.8788 96.0942 54.4193 43.2169 1.5348 11.6983 0.2086 0.4742 16.3856 4.1926 23.7154 9.7108 14.7680 0.0698 0.2700 9.8211 49.8353 11.7202 22.8710 32.9756 22.2104 25.9616 1.3177 11.4380 19.6431 23.9743 7.3314 0.5693 0.1261 0.4522 11.1673 1.1300 1.8673 38.2134 37.1071 11.8729 10.9453 27.0931 1.3681 7.7638 71.0290 3.8055 0.2220 4.1915 0.2648 2.6375 2.8579 20.9510 0.4610 2.7968 4.5303 0.4386 0.9240 13.7943 0.1725 15.9298 12.7267 7.3858 2.9811 51.3829 42.1122 15.6492 3.7258 1.2184 6.2552 13.1569 40.8763 40.5945 24.6670 11.9279 26.4916 9.4165 10.2307 12.6085 9.2736 45.0200 17.3525 10.4251 4.0572 1.2169 6.6106
temp: 298.150 k
press: 1.00000 atm
elementType: 17 8 6 6 6 6 6 6 6 6 6 6 6 6 6 6 6 1 1 1 1 1 1 1 1 1 1 1 1 1 1 1
symmnumber: 1
zpe: 672491.7 jmol-1
zpe.correction: 0.256139 hartree
zpe.thermalcorrener: 0.271847 hartree
zpe.thermalcorrenthalpy: 0.272791 hartree
zpe.thermalcorrgfe: 0.209230 hartree
zpe.sumelectzpe: -1114.651530 hartree
zpe.sumelectthermal: -1114.635822 hartree
zpe.sumelectthermalent: -1114.634878 hartree
zpe.sumelectthermalfe: -1114.698439 hartree
dipole: -2.9500 1.5104 1.7408
dipole: 3.7435
quadrupole: -115.0567 -102.0236 -104.0918
quadrupole: -2.1008 0.4570 -2.8316
quadrupole: -7.9993 5.0338 2.9655 -2.1008 0.4570 -2.8316
hfenergy: -1114.9076689 hartree
pointgroup: C01 [X(C15H15Cl1O1)]
dipole: 1.0720666 0.7624291 -0.6622454 debye
polarizability: 215.6330506|31.9199689|158.0608022|-14.1727385|20.4708508|128.6558989 unknown
InChI: InChI=1S/C15H15ClO/c16-14-9-7-13(8-10-14)15(17)11-6-12-4-2-1-3-5-12/h1-5,7-10,15,17H,6,11H2
charge 0 multiplicity 1
32 atoms
Cl -5.261293 -2.246006 0.534009
O  -0.752522 2.812301 0.658388
C  0.5712 1.232458 -0.74443
C  -0.810631 1.898274 -0.49727
C  1.067489 0.355225 0.436093
C  -1.921195 0.889416 -0.225834
C  2.481665 -0.154579 0.202404
C  -2.343611 0.020118 -1.262708
C  -2.539423 0.795071 1.043486
C  2.709835 -1.378354 -0.479151
C  3.606867 0.600436 0.624991
C  -3.356982 -0.938374 -1.041273
C  -3.556511 -0.157271 1.28289
C  4.022847 -1.833786 -0.736226
C  4.922202 0.150385 0.370382
C  -3.946904 -1.011822 0.23565
C  5.135149 -1.069051 -0.313721
H  0.51495 0.616667 -1.663457
H  1.316395 2.028899 -0.95098
H  -1.074517 2.479581 -1.409461
H  0.371234 -0.493979 0.565998
H  1.020751 0.956811 1.363415
H  -1.887992 0.086461 -2.258314
H  -2.225162 1.479712 1.835042
H  1.851231 -1.981227 -0.801722
H  3.449832 1.542278 1.166536
H  -0.051306 3.490023 0.488984
H  -3.683284 -1.606952 -1.843001
H  -4.035093 -0.228864 2.263957
H  4.178785 -2.784587 -1.258835
H  5.778631 0.744531 0.709683
H  6.154064 -1.421996 -0.508823
