program: Gaussian 09
title: 000244771
version: EM64L-G09RevD.01
frameworkgroup: C1[X(C15H13ClO)]
method: RPBEPBE
basis: SDD
operation: Freq
keyword: #p
keyword: freq=noraman
keyword: PBEPBE/SDD
title: #p freq=noraman PBEPBE/SDD
converged: NO YES NO NO
title: Mulliken charges:
elementType: Cl O C C C C C C C C C C C C C C C H H H H H H H H H H H H H
charge: -0.063610 -0.221499 -0.570592 -0.522181 0.508000 0.129402 0.282738 -0.403869 -0.403423 -0.341289 -0.344108 -0.214398 -0.214534 -0.108234 -0.244968 -0.228377 -0.222534 0.234895 0.235103 0.249322 0.249329 0.240644 0.240617 0.247126 0.278096 0.253417 0.253438 0.232076 0.234641 0.234773
chargesum: 0.00000
title: Mulliken charges with hydrogens summed into heavy atoms:
elementType: Cl O C C C C C C C C C C C C C C C
charge: -0.063610 -0.221499 -0.100594 -0.023530 0.508000 0.129402 0.282738 -0.163226 -0.162806 -0.094163 -0.066013 0.039018 0.038904 -0.108234 -0.012891 0.006264 0.012238
polarizability: 2.50255804e+02 1.32273864e+01 1.48393251e+02 -4.25034908e-01 4.54681831e-04 1.14383132e+02
1716.lowfreq: -15.5191 -4.1326 -1.8026 0.0006 0.0021 0.0024 9.1254 24.7952 32.3775
frequency: 3.2303 24.0734 32.3703 38.0435 85.5578 100.4865 158.0063 163.7735 219.2497 232.1970 298.5364 351.1101 365.0646 393.6150 400.1987 408.5983 417.6939 459.9588 526.5921 569.8647 604.5170 613.6639 627.8607 661.0544 697.0998 715.0689 753.1770 764.7472 800.3834 811.9035 831.4707 855.0197 859.5091 942.2026 948.7403 966.4780 971.8507 989.7162 992.3050 994.6003 1000.1635 1012.6101 1026.0702 1064.0578 1073.3192 1086.1610 1101.2138 1139.1794 1173.5726 1183.2810 1187.7192 1208.1561 1215.7790 1266.8520 1284.7281 1298.2651 1314.8688 1344.3745 1374.8303 1387.5474 1395.5835 1431.1008 1436.4892 1468.2008 1478.9084 1479.2627 1568.5797 1585.8182 1597.5450 1602.3938 1612.0229 2970.8491 3013.0747 3018.3437 3073.4291 3125.4558 3127.8623 3129.0895 3138.2173 3149.6722 3159.0369 3165.7071 3168.8373 3169.5477
redmass: 4.0121 4.2133 8.1399 4.4778 2.7181 6.9360 3.9003 7.4870 5.9873 4.5884 6.5465 2.7970 6.4739 7.5786 2.8043 2.8986 3.1770 5.3931 3.0048 2.2191 6.8774 6.4503 6.8526 5.9454 1.8350 3.7820 1.4716 5.9139 1.6022 1.8950 1.2484 2.6904 1.2481 1.3925 1.4470 1.3695 4.2459 6.2656 1.4012 1.8245 4.2827 1.3695 2.1468 3.0487 2.6945 1.6604 1.3811 1.1469 1.0706 1.1203 1.1288 2.0652 2.3423 1.1818 2.0144 1.2620 1.3593 1.6856 6.5178 9.3408 2.7800 1.1667 2.0043 1.1208 2.3938 2.2000 6.9287 7.3258 6.8065 6.3654 6.4565 1.0599 1.0603 1.0979 1.1029 1.0898 1.0898 1.0851 1.0880 1.0925 1.0960 1.0949 1.0960 1.1013
irintensity: 0.0142 0.7764 0.5342 1.3861 3.8753 0.3445 0.3096 0.5046 6.2919 0.0524 5.2056 0.3679 5.0654 15.8569 0.0477 0.0097 1.2508 1.9007 35.4306 5.8593 2.1263 0.4512 0.0972 18.3540 46.9608 4.4700 60.1952 11.9162 6.2133 40.7195 0.0018 22.8395 0.5524 2.3800 3.2839 0.0040 62.0812 4.3464 0.7747 0.1330 39.1069 0.1241 1.5957 0.3086 38.3492 7.5949 7.8591 2.9580 4.3760 0.8752 29.9818 64.4020 0.1104 0.0949 152.9797 0.1098 2.1728 55.7376 0.0774 2.4101 3.8865 8.9840 28.1699 19.6151 67.7299 19.9970 96.0077 0.9316 34.7314 9.5858 13.8611 22.0520 14.0665 4.3910 14.7288 11.5679 13.0008 0.3805 5.2616 18.3471 19.9518 8.2005 0.7499 22.4445
temp: 298.150 k
press: 1.00000 atm
elementType: 17 8 6 6 6 6 6 6 6 6 6 6 6 6 6 6 6 1 1 1 1 1 1 1 1 1 1 1 1 1
symmnumber: 1
zpe: 612831.1 jmol-1
zpe.correction: 0.233415 hartree
zpe.thermalcorrener: 0.248650 hartree
zpe.thermalcorrenthalpy: 0.249595 hartree
zpe.thermalcorrgfe: 0.185470 hartree
zpe.sumelectzpe: -1113.488096 hartree
zpe.sumelectthermal: -1113.472861 hartree
zpe.sumelectthermalent: -1113.471917 hartree
zpe.sumelectthermalfe: -1113.536042 hartree
dipole: -2.8571 2.3602 -0.0179
dipole: 3.7059
quadrupole: -108.4188 -110.6993 -101.4961
quadrupole: -11.2472 -0.0766 0.0523
quadrupole: -1.5474 -3.8279 5.3753 -11.2472 -0.0766 0.0523
hfenergy: -1113.7215115 hartree
pointgroup: C01 [X(C15H13Cl1O1)]
dipole: -1.1672564 -0.873512 0.0163692 debye
polarizability: 248.755724|-18.0365934|149.8889207|0.6135688|-0.396958|114.3875424 unknown
InChI: InChI=1S/C15H13ClO/c16-14-9-6-12(7-10-14)8-11-15(17)13-4-2-1-3-5-13/h1-7,9-10H,8,11H2
charge 0 multiplicity 1
30 atoms
Cl 6.339959 -1.478677 0.011938
O  -1.783539 2.28708 -0.031793
C  0.875045 1.398289 -0.016023
C  -0.280466 0.369233 0.005514
C  2.233419 0.714852 -0.008955
C  -1.665853 1.025562 -0.009879
C  -2.884344 0.142799 -0.000368
C  2.883949 0.394846 1.211077
C  2.871948 0.348909 -1.222384
C  -2.801389 -1.276009 0.025735
C  -4.165081 0.760772 -0.01882
C  4.129731 -0.271852 1.229755
C  4.117613 -0.318128 -1.22842
C  4.72783 -0.620805 0.003828
C  -3.975922 -2.058679 0.033155
C  -5.336642 -0.020992 -0.011613
C  -5.245018 -1.434188 0.01444
H  0.761742 2.036544 -0.910485
H  0.767629 2.067967 0.855875
H  -0.198065 -0.277061 0.903016
H  -0.197052 -0.315351 -0.863009
H  2.41924 0.677994 2.163411
H  2.397594 0.595963 -2.180002
H  -1.826865 -1.775285 0.040344
H  -4.207861 1.854905 -0.038738
H  4.62606 -0.509289 2.175474
H  4.60466 -0.590924 -2.169393
H  -3.904186 -3.151615 0.053277
H  -6.318919 0.463724 -0.026272
H  -6.155618 -2.043777 0.020015
