program: Gaussian 09
title: 000244758
version: EM64L-G09RevD.01
frameworkgroup: C1[X(C6H9F3O2)]
method: RPBEPBE
basis: SDD
operation: Freq
keyword: #pfreq=noraman
keyword: PBEPBE/SDD
title: #p freq=noraman PBEPBE/SDD
converged: YES YES NO NO
title: Mulliken charges:
elementType: F F F O O C C C C C C H H H H H H H H H
charge: -0.139105 -0.149651 -0.150192 -0.252761 -0.194570 0.055773 -0.374941 -0.696981 -0.684866 0.226863 0.325073 0.237373 0.219592 0.201077 0.230039 0.251920 0.223058 0.240122 0.209224 0.222952
chargesum: 0.00000
title: Mulliken charges with hydrogens summed into heavy atoms:
elementType: F F F O O C C C C C C
charge: -0.139105 -0.149651 -0.150192 -0.252761 -0.194570 0.293147 0.045728 0.008036 -0.012567 0.226863 0.325073
polarizability: 8.42291673e+01 -1.63020099e+00 7.10701203e+01 -4.74560520e+00 2.32874816e+00 6.44517006e+01
1716.lowfreq: -20.7896 -10.4588 -6.0626 -0.0008 0.0008 0.0011 5.1384 39.9586 56.8593
frequency: -20.6623 39.7761 56.6786 105.5025 119.3277 193.3396 205.7737 215.5953 231.9703 265.2565 304.3210 368.8788 383.1333 416.1319 444.5674 485.0372 517.4242 637.7060 704.4664 734.1093 785.7222 808.0552 859.4722 966.9978 993.7973 1017.2952 1035.1619 1059.2231 1064.0548 1106.9991 1131.8090 1181.1092 1241.2263 1266.5189 1295.4128 1328.5484 1360.6992 1391.8554 1393.4665 1451.5249 1467.3596 1476.3931 1478.5995 1487.1576 1649.9684 2986.0111 2990.2741 2996.3314 3020.6775 3047.6466 3081.4121 3092.7571 3096.0073 3105.8822
redmass: 11.9885 4.9406 3.6484 2.2557 3.6515 2.5204 1.0784 1.6798 4.5748 6.0380 5.9058 7.8558 3.7256 3.2209 10.0649 3.6804 7.7765 13.9119 12.6130 2.3585 4.1046 1.9778 2.1041 1.3087 1.3522 12.8093 3.0120 12.7115 8.4163 1.9002 2.2070 2.0273 4.1200 1.3355 1.3202 1.2817 1.7210 1.2104 1.2131 1.0756 1.0562 1.0460 1.0451 1.0522 12.1443 1.0370 1.0575 1.0389 1.0875 1.0992 1.0994 1.0988 1.1001 1.1014
irintensity: 0.0524 0.4938 0.1304 0.0511 0.1806 2.3123 0.2281 2.3330 2.6248 4.9244 4.3090 4.5306 6.6057 0.9241 4.0580 5.6628 0.5004 14.1438 13.2897 3.8314 4.1282 46.7098 6.3443 10.9035 26.9382 228.3124 9.0931 302.0007 316.8728 2.5254 12.7839 10.0636 95.0542 8.4335 0.3382 7.3039 3.0238 8.9653 28.2858 3.7382 15.0850 5.3993 19.9687 12.7578 221.1783 29.8574 10.1340 21.5179 5.3669 10.0158 40.7865 8.0662 51.5261 18.4842
temp: 298.150 k
press: 1.00000 atm
elementType: 9 9 9 8 8 6 6 6 6 6 6 1 1 1 1 1 1 1 1 1
symmnumber: 1
zpe: 383668.8 jmol-1
zpe.correction: 0.146132 hartree
zpe.thermalcorrener: 0.157736 hartree
zpe.thermalcorrenthalpy: 0.158681 hartree
zpe.thermalcorrgfe: 0.107805 hartree
zpe.sumelectzpe: -683.128995 hartree
zpe.sumelectthermal: -683.117390 hartree
zpe.sumelectthermalent: -683.116446 hartree
zpe.sumelectthermalfe: -683.167322 hartree
dipole: 4.6488 0.2137 -0.6471
dipole: 4.6985
quadrupole: -61.5980 -64.5242 -67.1559
quadrupole: 1.7583 1.0571 -3.1743
quadrupole: 2.8281 -0.0982 -2.7299 1.7583 1.0571 -3.1743
hfenergy: -683.2751266 hartree
pointgroup: C01 [X(C6H9F3O2)]
dipole: -1.7892782 0.2917459 0.3611168 debye
dipolederiv: -0.3903002 0.0151077 0.0206974 -0.0278266 -0.5825011 0.2796426 0.0536978 0.267433 -0.5191301 -0.4654567 0.1519181 0.1703889 0.1557327 -0.4145688 -0.2174375 0.120898 -0.1750605 -0.6249433 -0.6795911 -0.1892748 -0.1670821 -0.1387125 -0.479328 -0.1020722 -0.1749295 -0.1218728 -0.352057 -1.5201522 0.0217554 0.4080026 0.0139668 -0.4539742 0.0720147 0.3548568 0.0723014 -0.4725463 -0.6014145 0.0809846 0.0364711 -0.2096778 -0.5316857 0.3126433 0.3271298 0.2143829 -0.572535 0.9520487 -0.0629749 -0.1220569 -0.2382954 0.3842901 0.1062738 0.0546985 0.0655075 0.2646374 0.0123974 -0.0187451 0.0357719 -0.0242462 0.0204391 -0.042056 0.0208582 -0.0249169 0.107493 -0.1099237 -0.060698 0.0082156 0.0145788 -0.1381326 -0.0821183 -0.0374199 -0.0900339 0.0298896 0.0332584 -0.0333084 -0.0011818 -0.0182957 -0.0403289 -0.0489511 0.0289369 -0.0397763 0.0551085 1.3488956 -0.0568466 -0.3726965 0.3107808 0.5432345 -0.5105331 -0.7161613 -0.3735073 0.7140562 1.4404197 0.0704815 -0.0265746 0.0463322 1.4475568 0.0921813 0.0126894 0.0832598 1.4836333 -0.0165392 0.0034605 0.0483964 0.0537872 0.0403349 -0.0152291 -0.0301072 0.0127368 -0.1003459 0.091612 -0.0064773 -0.0512874 -0.0386256 0.043123 0.0122661 -0.0066005 0.0168498 -0.1456853 -0.1019304 0.1003784 0.0098572 0.0954816 -0.0336697 -0.0043784 -0.0182485 0.0037513 0.0862314 0.1179034 0.0014894 -0.0134178 -0.0046532 0.0595887 0.0821473 -0.0083972 0.0097856 -0.1043017 -0.0173245 -0.125879 0.023123 -0.0965268 0.0196851 -0.0001333 0.0443793 0.0215343 0.0729665 -0.0738208 0.1118738 -0.0304579 0.1167898 0.0575844 -0.0084425 -0.0257943 0.0078706 0.0844485 -0.048839 0.1355633 -0.0103018 0.1039482 0.0364208 -0.0150711 -0.0251097 0.00354 0.0749839 0.0990341 0.0078219 -0.0090083 0.0175007 0.0474513 0.0798955 -0.0321805 0.020613 -0.1567866 -0.070277 -0.1466303 0.0431409 -0.1320388 -0.0255198 0.0093581 0.0568037 0.0256017 0.0748831 unknown
polarizability: 84.017316|0.4319314|71.1863511|-5.7499977|-0.8597705|64.5473211 unknown
InChI: InChI=1S/C6H9F3O2/c1-3-4(2)11-5(10)6(7,8)9/h4H,3H2,1-2H3
charge 0 multiplicity 1
20 atoms
F  1.562246 -1.567864 0.969492
F  2.374716 -1.223314 -1.117465
F  2.873245 0.233579 0.555034
O  -0.475217 -0.062851 0.319102
O  0.736044 1.199578 -1.243814
C  -1.760296 0.716535 0.043229
C  -2.897202 -0.247258 0.402437
C  -1.719567 2.002597 0.875057
C  -2.932817 -1.51611 -0.473761
C  0.634991 0.303172 -0.384335
C  1.850361 -0.577377 0.020627
H  -1.753181 0.947681 -1.039346
H  -2.806604 -0.521074 1.470863
H  -3.845539 0.315882 0.295217
H  -1.65168 1.770546 1.952029
H  -0.864806 2.63787 0.58841
H  -2.645156 2.580876 0.702192
H  -2.005905 -2.102675 -0.353018
H  -3.043028 -1.26208 -1.544756
H  -3.783105 -2.161917 -0.191794
