program: Gaussian 09
title: 000244753
version: EM64L-G09RevD.01
frameworkgroup: C1[X(C9H8ClF3)]
method: RPBEPBE
basis: SDD
operation: Freq
keyword: #p
keyword: freq=noraman
keyword: PBEPBE/SDD
title: #p freq=noraman PBEPBE/SDD
converged: YES YES NO NO
title: Mulliken charges:
elementType: Cl F F F C C C C C C C C C H H H H H H H H
charge: -0.010085 -0.146797 -0.150158 -0.154945 0.577443 -0.719627 -0.321815 -0.413545 0.438724 0.461884 -0.370749 -0.376116 -0.800836 0.317857 0.261847 0.232166 0.236641 0.237618 0.228544 0.230244 0.241703
chargesum: 0.00000
title: Mulliken charges with hydrogens summed into heavy atoms:
elementType: Cl F F F C C C C C C C C C
charge: -0.010085 -0.146797 -0.150158 -0.154945 0.577443 -0.401770 -0.059968 -0.181379 0.438724 0.461884 -0.134107 -0.138497 -0.100346
polarizability: 1.50033598e+02 -1.55106983e+01 7.48942967e+01 4.84182875e-01 1.86744327e+00 9.83819266e+01
1716.lowfreq: -7.6622 -0.0026 -0.0025 0.0006 5.0879 7.2832 14.5748 26.9105 56.2895
frequency: -3.7274 26.7242 56.2828 74.3922 139.1833 159.8870 173.5205 253.2613 275.6226 308.5207 345.1894 353.7986 403.8631 451.6697 472.5853 506.8170 535.6578 609.8851 632.6789 701.5565 732.3728 763.2904 782.0130 838.6133 847.7376 850.1606 956.7316 978.4047 989.2165 1000.7454 1014.6588 1030.4468 1047.8941 1130.3337 1176.0946 1192.5534 1201.2312 1226.9762 1232.6055 1309.7629 1335.1816 1387.8774 1398.2725 1415.4883 1470.0986 1472.9023 1509.2311 1583.2527 1623.2052 2978.0838 3060.4330 3090.1188 3094.0959 3120.4618 3131.1022 3144.3668 3168.1561
redmass: 1.0574 4.0899 8.3645 8.4389 6.7139 7.3562 7.3578 7.0828 9.8376 12.9461 4.5399 3.1284 2.8419 12.7839 14.3664 3.0117 6.4976 7.9657 7.0228 5.1176 3.4399 4.3073 4.1052 1.7782 1.7098 2.4418 1.3448 1.3971 1.4169 6.4103 2.9897 7.4319 1.5851 1.3579 3.9292 1.3024 1.1537 2.0919 3.7066 1.4979 1.7220 3.7029 1.2213 2.6249 1.1061 1.0558 2.6548 5.9464 6.3142 1.0390 1.0946 1.1000 1.0863 1.0877 1.0897 1.0968 1.0954
irintensity: 0.6323 0.2961 0.0814 0.2551 3.7543 1.0489 1.5598 0.9565 0.6173 2.9562 4.0919 2.2102 0.2121 5.7180 9.1184 7.7540 17.0974 30.2082 8.0756 44.5045 24.2050 38.4050 36.7854 14.8274 16.3819 18.9179 4.0581 3.9715 3.0942 173.1971 6.4813 188.7295 18.4047 16.3922 169.8002 24.1270 7.4044 10.4713 42.6365 3.8683 9.8559 2.4345 14.0634 6.0579 16.9107 13.5986 9.6803 0.1813 37.4305 23.9403 20.2277 16.0337 3.1634 9.0676 15.7388 17.0052 1.9188
temp: 298.150 k
press: 1.00000 atm
elementType: 17 9 9 9 6 6 6 6 6 6 6 6 6 1 1 1 1 1 1 1 1
symmnumber: 1
zpe: 387382.3 jmol-1
zpe.correction: 0.147546 hartree
zpe.thermalcorrener: 0.159368 hartree
zpe.thermalcorrenthalpy: 0.160312 hartree
zpe.thermalcorrgfe: 0.107885 hartree
zpe.sumelectzpe: -1106.394143 hartree
zpe.sumelectthermal: -1106.382321 hartree
zpe.sumelectthermalent: -1106.381377 hartree
zpe.sumelectthermalfe: -1106.433804 hartree
dipole: 4.2559 0.3281 1.0930
dipole: 4.4063
quadrupole: -77.1292 -88.5612 -74.6184
quadrupole: -1.3522 -1.8754 2.3218
quadrupole: 2.9737 -8.4583 5.4845 -1.3522 -1.8754 2.3218
hfenergy: -1106.5416889 hartree
pointgroup: C01 [X(C9H8Cl1F3)]
dipole: -1.6750919 0.1425414 -0.4230453 debye
dipolederiv: -0.4701944 -0.1458833 -0.0793042 -0.3857879 -0.4076921 -0.1682295 -0.3604813 -0.2493443 -0.2691755 -0.9709012 -0.123264 0.1163805 -0.0010991 -0.3450065 0.0132545 0.1406097 0.0344032 -0.2879368 -0.3929504 0.0659223 -0.0273966 0.083393 -0.4199045 0.2140589 0.0494079 0.1723661 -0.6340706 -0.419052 0.0227131 -0.0184151 -0.0154439 -0.630334 -0.324086 -0.07344 -0.2324191 -0.5040182 -0.3700845 -0.1067196 -0.0116061 0.0307266 -0.1130155 -0.0364165 0.0643624 -0.0325622 -0.0741217 0.7318299 0.383182 0.1607877 0.5197728 0.396236 0.2551543 0.2713908 0.3718924 0.3280643 0.0784191 0.0069583 0.0712332 0.1111048 -0.0336219 -0.0261332 -0.0319303 -0.0702928 -0.0241133 0.1089534 0.0769789 -0.0455789 -0.0435547 -0.0963003 -0.1079416 0.0863718 -0.0506106 0.0404103 0.528251 0.1000625 -0.028519 0.0327301 -0.0057777 -0.0184205 -0.0637061 -0.0238646 0.0132129 1.6764173 -0.0803823 -0.1226823 -0.1762354 1.3548066 0.0750655 -0.1714281 -0.0646352 1.3123882 -0.3077997 -0.0031707 -0.0834625 0.0681846 -0.0858609 -0.1087167 -0.1684072 -0.1354037 0.0333213 -0.2129556 -0.0836324 0.1167655 -0.1212688 -0.1415966 -0.0552244 0.2383179 -0.0266965 -0.0054572 -0.2226915 -0.0479939 0.0238489 0.0649043 0.0764082 -0.0078761 0.0983309 0.013351 0.0684736 0.0732961 0.009046 -0.0272675 -0.0170847 0.0297133 -0.0113387 0.0365903 -0.0050961 -0.0399626 0.062387 0.0138129 -0.0721154 0.0025114 0.1177279 0.0400005 -0.0792465 0.040485 0.0455907 0.0457007 -0.0585509 0.0781779 -0.055937 0.080388 0.0909071 0.0522902 0.0905273 -0.0026541 0.0434637 -0.0562373 0.0588083 -0.0604875 0.0807118 0.0977781 0.0574706 0.0967009 -0.01031 -0.0118848 0.021116 -0.1037903 0.0214679 0.1233766 0.0589467 -0.0999991 0.0638963 0.0042186 0.0231498 -0.0257234 -0.041527 -0.0389984 0.0999248 0.0125692 -0.1303207 -0.027759 -0.09785 0.0498308 -0.0048151 -0.0105778 -0.0927453 -0.0665332 0.0924124 0.0169412 0.1159361 0.044278 -0.0431847 0.036581 0.0462407 0.0738473 -0.0136499 -0.085764 0.0668756 -0.0808743 0.0597122 unknown
polarizability: 147.1914047|19.6486964|80.8129341|7.7939876|-7.5510528|95.3054825 unknown
InChI: InChI=1S/C9H8ClF3/c1-6-2-4-7(5-3-6)8(10)9(11,12)13/h2-5,8H,1H3
charge 0 multiplicity 1
21 atoms
Cl 1.894013 2.051037 1.051439
F  3.667342 -0.032288 -0.408523
F  2.340492 -1.061285 1.111501
F  2.01031 -1.407191 -1.106711
C  -0.096233 0.410297 -0.128333
C  1.361055 0.759881 -0.254427
C  -0.615994 -0.297231 0.986918
C  -0.983505 0.81758 -1.15595
C  -2.887103 -0.195018 0.029794
C  2.3386 -0.419942 -0.142519
C  -1.990243 -0.59488 1.05654
C  -2.358545 0.514098 -1.078754
C  -4.371249 -0.493257 0.13214
H  1.57123 1.254479 -1.214995
H  0.050297 -0.606871 1.797667
H  -0.597638 1.36775 -2.022824
H  -2.37814 -1.145294 1.921846
H  -3.028671 0.830594 -1.8865
H  -4.838584 -0.57716 -0.864359
H  -4.559152 -1.432678 0.68069
H  -4.898283 0.31488 0.675858
