program: Gaussian 09
title: 000244715
version: EM64L-G09RevD.01
frameworkgroup: C1[X(C20H22N4O6S2)]
method: RPBEPBE
basis: SDD
operation: Freq
keyword: #p
keyword: freq=noraman
keyword: PBEPBE/SDD
title: #p freq=noraman PBEPBE/SDD
converged: NO YES NO NO
title: Mulliken charges:
elementType: S S O O O O O O N N N N C C C C C C C C C C C C C C C C C C C C H H H H H H H H H H H H H H H H H H H H H H
charge: -0.020774 0.056853 -0.460570 -0.442146 -0.250819 -0.207691 -0.304758 -0.374265 -0.468824 -0.422550 -0.503074 -0.480126 -0.109890 -0.089704 -0.677086 -0.744543 0.189763 0.180944 0.282196 0.334815 0.470705 0.490343 -0.445725 -0.474402 -0.347295 -0.356874 -0.202727 -0.206288 -0.213856 -0.203181 -0.260568 -0.263463 0.299481 0.299942 0.329703 0.310201 0.366286 0.308376 0.370902 0.353772 0.314993 0.311991 0.210600 0.241741 0.307078 0.289436 0.427784 0.400285 0.222568 0.236757 0.224410 0.233320 0.226984 0.238967
chargesum: 0.00000
title: Mulliken charges with hydrogens summed into heavy atoms:
elementType: S S O O O O O O N N N N C C C C C C C C C C C C C C C C C C C C
charge: -0.020774 0.056853 -0.032786 -0.041861 -0.250819 -0.207691 -0.304758 -0.374265 -0.097922 -0.068778 -0.188082 -0.168135 0.189591 0.210238 -0.037182 -0.069881 0.189763 0.180944 0.282196 0.334815 0.470705 0.490343 -0.235126 -0.232660 -0.040217 -0.067438 0.019841 0.030469 0.010553 0.030139 -0.033584 -0.024497
polarizability: 4.40701264e+02 -3.46347551e+01 2.73451286e+02 3.01491040e+01 1.22481965e+01 2.10458480e+02
1716.lowfreq: -12.5488 -5.9492 0.0020 0.0023 0.0026 2.8334 13.4418 22.8166 29.3377
frequency: 13.0926 22.7636 29.2321 33.0738 36.3122 45.2204 52.0720 55.2209 60.9383 70.0014 79.6481 86.9779 92.9808 106.2226 106.9921 114.0554 122.7519 151.5842 160.0239 167.9906 180.3064 213.6148 224.8562 237.4029 240.3015 249.6394 258.0004 298.3703 309.0279 329.0955 340.4615 353.6798 357.9060 397.4934 405.8436 408.3121 435.5408 451.6012 478.5829 486.4978 501.1571 507.4768 523.7707 528.8124 532.5258 566.9555 586.4482 593.1923 596.4896 609.7043 611.7337 615.1683 621.9687 645.5738 648.4445 689.5673 694.9243 697.0074 708.9321 720.2973 736.7912 745.3183 745.7600 764.7277 768.7647 811.8481 825.9690 834.6438 836.6982 837.5971 843.6508 905.3739 909.8027 911.2746 912.8656 920.3778 954.6250 967.6313 968.1400 972.6970 983.2973 984.8931 994.3091 997.9146 1004.8014 1011.4817 1028.1529 1030.4370 1075.4762 1088.5310 1091.7622 1116.9838 1138.0731 1164.0068 1171.0566 1174.3678 1175.9658 1185.2595 1187.0236 1190.7742 1211.2196 1221.3824 1231.8668 1241.6077 1265.8353 1270.7360 1285.0466 1294.0096 1308.2251 1311.1241 1317.8823 1324.3847 1336.3152 1371.2147 1384.2065 1385.1300 1410.4333 1423.4748 1428.3051 1429.4128 1470.5422 1483.1585 1488.4543 1495.4804 1516.5742 1520.5962 1590.8123 1598.2329 1608.9933 1616.5326 1616.9781 1635.1421 1639.7726 1680.5035 2773.5891 2979.0683 2997.4166 3026.8910 3050.5600 3106.0383 3109.3753 3115.7542 3130.1359 3136.1699 3137.8450 3141.1617 3145.0178 3163.7202 3166.9864 3188.1942 3193.3085 3490.0445 3504.7031 3522.6616 3532.2029 3541.0480
redmass: 6.5862 5.6492 5.1222 6.0798 6.4250 4.7328 10.6992 5.9602 6.2636 7.2962 8.4247 7.0393 7.4447 9.0691 7.7909 8.0236 7.2998 8.5267 7.6787 8.3767 7.0128 6.6426 5.2860 4.2597 4.1133 4.5214 5.1081 4.4306 3.5300 4.5635 5.9634 4.7281 5.0382 12.5322 2.9284 2.9514 2.1928 3.5643 2.3119 2.1376 4.1445 4.5890 4.1704 2.2302 1.8714 5.5456 1.3910 4.5252 4.5331 3.3200 5.8955 3.7731 4.9157 2.3226 1.1696 4.3077 2.3493 2.0303 10.0946 4.7154 6.3831 6.2037 6.9411 1.7098 1.6813 2.5621 3.4288 2.3350 4.0464 1.6180 1.2654 2.2944 1.9604 1.5460 1.5127 1.7037 3.1286 1.3516 2.5344 1.3777 5.7730 5.6731 1.3307 1.3027 4.9603 4.3066 2.1324 2.1993 1.8963 1.5667 1.6041 1.6624 2.7156 2.6288 1.0523 1.0584 1.5365 1.3086 1.1129 1.1159 1.3497 1.2899 1.7045 1.5216 1.9315 2.0794 1.6399 1.6053 1.2698 1.4087 1.8027 1.4577 1.5733 1.7380 5.5181 5.5932 1.1096 1.4689 1.5098 2.3148 1.9536 2.0911 2.3957 2.3599 2.4628 2.5019 5.9864 6.2520 3.2987 5.9903 5.5417 5.1069 5.3330 9.4019 1.0770 1.0818 1.0812 1.0605 1.0567 1.0878 1.1051 1.0878 1.0867 1.0891 1.1087 1.0934 1.0926 1.0997 1.0982 1.0962 1.0950 1.0780 1.0767 1.0762 1.0646 1.0778
irintensity: 0.2453 0.1739 0.1009 1.0784 0.1918 1.3913 4.4644 2.9987 1.1229 0.3857 0.3711 2.0724 7.4559 0.0779 2.6958 1.0305 6.6981 4.7045 3.1418 8.2037 19.5466 26.8498 23.0188 2.5316 1.9067 5.0453 9.8591 4.2034 13.0256 5.6889 4.4500 11.3461 5.5608 3.9338 0.2516 0.0984 21.7358 12.4622 12.6305 8.1566 42.4664 13.1410 82.7021 12.6804 44.7854 14.0244 89.5910 28.5137 25.3437 39.5604 0.3334 37.1597 13.7852 63.7632 71.9852 118.2073 8.9584 53.9345 18.4568 4.8239 5.1450 55.3124 10.7480 90.7701 117.7893 30.6127 8.7772 39.7126 5.7109 18.3265 2.3227 114.2940 73.7666 43.0680 89.3549 144.5849 48.1382 0.5729 24.6979 1.5405 3.6381 0.1706 1.1871 3.3012 7.8622 9.4198 10.9171 18.0638 191.4359 17.5446 12.5421 26.4143 16.0518 45.6642 1.1483 1.1869 86.4265 16.8894 6.2136 2.2923 10.4790 2.7231 203.0654 42.5243 47.3201 46.6326 53.8403 22.3978 23.2144 18.3362 46.8608 48.5880 40.6410 20.0627 48.7143 33.1912 44.3117 63.7996 2.2123 17.8392 603.3961 228.9572 15.3251 7.6409 101.8298 1317.9776 99.4474 57.2643 39.4889 48.7482 78.0456 187.4259 192.4231 225.3575 931.3954 11.1044 10.0300 7.5181 5.5891 28.4088 23.2073 9.1177 0.4237 2.7174 0.2517 36.2777 21.5786 28.2092 18.0782 1.5158 9.1172 57.7271 108.0798 12.8839 39.7337 121.0255
temp: 298.150 k
press: 1.00000 atm
elementType: 16 16 8 8 8 8 8 8 7 7 7 7 6 6 6 6 6 6 6 6 6 6 6 6 6 6 6 6 6 6 6 6 1 1 1 1 1 1 1 1 1 1 1 1 1 1 1 1 1 1 1 1 1 1
symmnumber: 1
zpe: 1064667.1 jmol-1
zpe.correction: 0.405510 hartree
zpe.thermalcorrener: 0.437012 hartree
zpe.thermalcorrenthalpy: 0.437956 hartree
zpe.thermalcorrgfe: 0.339008 hartree
zpe.sumelectzpe: -2239.534273 hartree
zpe.sumelectthermal: -2239.502772 hartree
zpe.sumelectthermalent: -2239.501828 hartree
zpe.sumelectthermalfe: -2239.600775 hartree
dipole: 0.9367 5.6629 -3.9617
dipole: 6.9743
quadrupole: -202.0499 -202.4689 -199.9052
quadrupole: -4.1714 -11.9281 0.0670
quadrupole: -0.5752 -0.9942 1.5694 -4.1714 -11.9281 0.0670
hfenergy: -2239.9397836 hartree
pointgroup: C01 [X(C20H22N4O6S2)]
dipole: 1.2031736 -1.5917721 1.8835269 debye
polarizability: 389.1188992|79.0320167|323.2655859|-42.7047106|-18.8324274|212.2265448 unknown
InChI: InChI=1S/C20H22N4O6S2/c25-17(26)15(23-19(29)21-13-7-3-1-4-8-13)11-31-32-12-16(18(27)28)24-20(30)22-14-9-5-2-6-10-14/h1-10,15-16,21-25,27H,11-12H2
charge 0 multiplicity 1
54 atoms
S  0.590582 2.475773 0.514528
S  2.323852 3.916273 0.135148
O  0.923406 -0.210534 -2.071521
O  5.276806 2.442152 2.194279
O  1.371931 1.877711 -2.995437
O  6.192819 3.628936 0.416566
O  -3.442779 1.457411 -0.928999
O  3.263897 -0.397498 -1.075751
N  -1.371244 0.402343 -1.105699
N  3.704094 0.974991 0.747503
N  -3.136755 -0.751486 -0.113349
N  2.161864 -0.751758 0.994518
C  -0.761418 1.512469 -1.838906
C  4.457471 1.94861 -0.047222
C  -0.5709 2.785531 -0.969792
C  3.563612 2.910966 -0.881878
C  0.608391 1.08693 -2.39094
C  5.4043 2.761134 0.835712
C  -2.710278 0.437251 -0.729286
C  3.058399 -0.086902 0.158095
C  -4.420214 -1.049021 0.419174
C  1.437504 -1.946246 0.714985
C  -4.611535 -2.349298 0.96475
C  0.241436 -2.174281 1.447771
C  -5.495948 -0.119911 0.434333
C  1.881835 -2.911635 -0.225426
C  -5.85331 -2.71546 1.521193
C  -0.499945 -3.358634 1.245199
C  -6.732992 -0.503987 0.995473
C  1.122616 -4.083561 -0.427327
C  -6.92568 -1.793381 1.542814
C  -0.066807 -4.319315 0.301212
H  -1.414671 1.815695 -2.683621
H  5.084333 1.401554 -0.780479
H  -1.543721 3.087789 -0.552665
H  -0.126117 3.601216 -1.560187
H  3.018723 2.371135 -1.670623
H  4.201489 3.678596 -1.356624
H  -0.784959 -0.434106 -1.019499
H  3.66513 1.138452 1.756026
H  -2.444652 -1.501541 -0.029796
H  1.835003 -0.223998 1.807639
H  -3.78769 -3.075329 0.942106
H  -0.102609 -1.431917 2.179292
H  -5.348095 0.873484 0.00728
H  2.799833 -2.741157 -0.791847
H  1.937695 -0.394197 -1.955913
H  5.883727 3.013097 2.737167
H  -5.983364 -3.722011 1.934727
H  -1.404428 -3.534636 1.839116
H  -7.556709 0.219069 1.002099
H  1.469993 -4.822287 -1.157713
H  -7.891597 -2.076307 1.974267
H  -0.640825 -5.237875 0.142328
