program: Gaussian 09
title: 000244703
version: EM64L-G09RevD.01
frameworkgroup: C1[X(C18H20O)]
method: RPBEPBE
basis: SDD
operation: Freq
keyword: #pfreq=noraman
keyword: PBEPBE/SDD
title: #p freq=noraman PBEPBE/SDD
converged: YES YES NO NO
title: Mulliken charges:
elementType: O C C C C C C C C C C C C C C C C C C H H H H H H H H H H H H H H H H H H H H
charge: -0.298052 -0.101510 -0.399233 0.403807 -0.684285 -0.415033 -0.397673 -0.332146 -0.233759 -0.226956 -0.180416 -0.242892 -0.328518 0.489371 -0.386706 -0.397861 -0.235747 -0.235463 -0.242106 0.194867 0.216703 0.207150 0.228792 0.208366 0.234374 0.226834 0.277384 0.188252 0.201616 0.222828 0.223351 0.236278 0.225587 0.218522 0.226383 0.226930 0.225441 0.226299 0.229221
chargesum: 0.00000
title: Mulliken charges with hydrogens summed into heavy atoms:
elementType: O C C C C C C C C C C C C C C C C C C
charge: -0.298052 0.093357 0.024621 0.403807 -0.012753 -0.188199 -0.120289 0.057722 -0.010931 -0.003605 0.055862 -0.017305 -0.109996 0.489371 -0.160323 -0.170931 -0.010306 -0.009164 -0.012886
polarizability: 2.99030512e+02 1.77924396e+00 1.84093301e+02 -3.04206388e+01 -3.19839491e+00 1.31500745e+02
1716.lowfreq: -14.1714 -3.3057 -0.0007 -0.0006 -0.0003 5.0103 19.2311 25.4203 28.0010
frequency: 18.5996 25.1299 27.9906 38.9807 64.5693 80.6440 87.5336 128.4071 153.2957 156.9413 196.1015 211.2314 241.0409 255.0635 290.9582 323.2863 378.4148 393.8376 402.6386 403.4939 452.5725 496.4235 531.4126 558.4001 612.8303 616.5709 618.3437 648.8373 696.7551 706.2970 751.1733 757.5265 768.7422 814.5330 821.9965 839.5200 851.5479 856.5968 872.2200 914.3005 923.0787 926.5507 976.2753 978.4756 979.8713 984.2933 988.4179 990.1362 996.5312 997.4278 998.8013 1025.5891 1027.9460 1052.3241 1074.0151 1078.8393 1080.6876 1102.4781 1118.7700 1170.7536 1172.5245 1184.7385 1189.2143 1194.2150 1205.9098 1224.8727 1250.6257 1262.7503 1284.1714 1298.6952 1308.4493 1326.7308 1337.8555 1350.1696 1373.1625 1385.4938 1388.5317 1390.7942 1436.3549 1441.1617 1462.7458 1468.8747 1472.2090 1483.1727 1486.1187 1489.8933 1585.0903 1592.8775 1612.9095 1614.9974 1670.8265 2899.7632 2901.3911 2974.2626 2981.0495 2987.9439 3026.8815 3076.2297 3081.8189 3087.8071 3108.7936 3116.8252 3121.1100 3123.9138 3126.3917 3137.6266 3138.5963 3149.3905 3156.2771 3165.0962 3174.4477
redmass: 3.6752 4.2056 4.8626 3.7247 3.2929 3.2266 3.8897 3.2702 2.8330 1.8798 2.8025 1.8466 3.3012 2.9774 3.3435 3.3109 3.3897 4.1871 2.8802 2.7913 3.4088 2.9167 3.4072 3.9436 5.0175 6.3780 5.2260 4.1410 1.7455 1.7987 2.1008 1.5768 1.5311 3.0588 2.6827 1.7180 1.4146 1.2493 2.4062 2.6708 1.5031 1.4897 1.3657 1.3683 1.3206 2.2814 5.3690 5.0867 1.6410 1.3425 1.7360 2.2354 2.1165 1.7800 2.7566 1.7558 1.7187 1.8544 2.4136 1.0537 1.0607 1.1110 1.1208 1.1082 1.9226 2.0492 1.2182 1.4047 1.3591 1.4160 1.4522 1.2909 1.2773 1.4416 1.9597 6.2159 1.4939 2.2190 2.1746 2.2697 1.0869 1.0437 1.0883 2.2850 2.3179 1.0580 5.7950 6.2179 6.0092 6.1030 6.1245 1.0627 1.0806 1.0922 1.0626 1.0386 1.1006 1.0901 1.0999 1.1002 1.0871 1.0873 1.0893 1.0868 1.0862 1.0931 1.0912 1.0959 1.0985 1.1015 1.0960
irintensity: 0.0090 0.1729 0.0637 0.5204 1.0702 0.8371 1.3609 0.3446 2.7910 0.5227 0.3995 1.1231 3.3633 6.0485 0.5714 0.9582 0.7366 0.5332 0.1370 0.0217 4.0366 9.2623 6.1851 8.7841 1.1994 0.1154 0.9880 9.8282 44.7591 55.2373 45.7498 25.1736 44.0709 2.1796 1.9520 2.6072 1.0133 0.2071 4.5301 21.1491 0.6331 2.6574 3.0789 6.5747 120.9614 34.0734 27.3446 8.4960 49.7971 3.2764 41.0335 7.3195 4.0296 41.9153 17.7324 6.7471 7.7193 57.2472 8.4279 0.4043 0.4760 5.1904 11.7857 16.5382 1.2457 1.0363 1.5950 4.3430 17.7471 14.5552 30.1103 22.3992 5.7638 6.8571 9.6197 5.1203 12.7603 12.7821 11.8547 8.0739 16.0992 6.7395 0.7683 15.6839 18.0604 9.9392 2.2394 1.6512 5.1844 6.7867 4.1963 36.0879 66.8200 43.1727 47.5172 22.4396 40.5975 20.0205 38.1695 47.1474 10.4304 7.4434 20.8068 1.3192 2.0327 34.5498 11.4325 44.2751 36.3677 25.9387 6.2715
temp: 298.150 k
press: 1.00000 atm
elementType: 8 6 6 6 6 6 6 6 6 6 6 6 6 6 6 6 6 6 6 1 1 1 1 1 1 1 1 1 1 1 1 1 1 1 1 1 1 1 1
symmnumber: 1
zpe: 855436.2 jmol-1
zpe.correction: 0.325818 hartree
zpe.thermalcorrener: 0.344030 hartree
zpe.thermalcorrenthalpy: 0.344974 hartree
zpe.thermalcorrgfe: 0.276098 hartree
zpe.sumelectzpe: -771.730469 hartree
zpe.sumelectthermal: -771.712258 hartree
zpe.sumelectthermalent: -771.711313 hartree
zpe.sumelectthermalfe: -771.780189 hartree
dipole: -0.3174 1.3425 -0.8599
dipole: 1.6255
quadrupole: -101.4871 -104.5797 -114.1423
quadrupole: 2.0351 -5.6400 -0.8701
quadrupole: 5.2492 2.1567 -7.4059 2.0351 -5.6400 -0.8701
hfenergy: -772.0562872 hartree
pointgroup: C01 [X(C18H20O1)]
dipole: 0.1290109 0.501757 0.3749575 debye
polarizability: 300.1822217|-2.7069473|183.5062017|-26.747841|7.2782267|130.9361346 unknown
InChI: InChI=1S/C18H20O/c1-2-18(17-13-7-4-8-14-17)19-15-9-12-16-10-5-3-6-11-16/h3-14,18H,2,15H2,1H3
charge 0 multiplicity 1
39 atoms
O  -0.982509 0.516737 0.181271
C  -2.320221 0.966824 0.608633
C  -2.634048 2.405781 0.101403
C  -3.33078 -0.061556 0.109366
C  -2.553709 2.552591 -1.431457
C  -4.638072 -0.074217 0.65842
C  -3.002698 -0.990165 -0.90782
C  0.126759 1.248297 0.821423
C  -5.604812 -0.994252 0.195683
C  -3.969566 -1.912126 -1.370824
C  1.366097 0.406228 0.695944
C  -5.273434 -1.917262 -0.824033
C  2.541028 0.860574 0.175768
C  3.810039 0.115302 0.048943
C  3.973071 -1.228772 0.493789
C  4.928817 0.763237 -0.547151
C  5.205557 -1.89415 0.342624
C  6.16428 0.098279 -0.698598
C  6.308991 -1.235621 -0.253878
H  -2.345427 0.984999 1.724312
H  -3.647041 2.679862 0.456711
H  -1.932825 3.114506 0.585931
H  -1.562426 2.23708 -1.803156
H  -2.721156 3.602153 -1.734205
H  -3.312374 1.925314 -1.931908
H  -4.90176 0.632681 1.45603
H  -1.987661 -0.986739 -1.314274
H  -0.126654 1.411714 1.895805
H  0.273881 2.242108 0.348024
H  -6.610157 -0.99538 0.632303
H  -3.703686 -2.627884 -2.157321
H  1.263086 -0.622987 1.063909
H  -6.02103 -2.63379 -1.182936
H  2.568091 1.89603 -0.198541
H  3.132897 -1.755931 0.95913
H  4.821995 1.798292 -0.895818
H  5.311063 -2.928211 0.690131
H  7.010748 0.617628 -1.161714
H  7.266048 -1.756476 -0.36842
