program: Gaussian 09
title: 000244684
version: EM64L-G09RevD.01
frameworkgroup: C1[X(C14H9NO5)]
method: RPBEPBE
basis: SDD
operation: Freq
keyword: #p
keyword: freq=noraman
keyword: PBEPBE/SDD
title: #p freq=noraman PBEPBE/SDD
converged: YES YES NO NO
title: Mulliken charges:
elementType: O O O O O N C C C C C C C C C C C C C C H H H H H H H H H
charge: -0.191370 -0.430895 -0.239657 -0.203422 -0.203277 0.018610 0.257717 0.403407 0.001825 0.099022 -0.485067 -0.357788 -0.364866 0.381289 -0.327966 -0.193912 -0.220328 -0.370239 -0.215754 0.095010 0.301834 0.265416 0.283829 0.283901 0.245190 0.242547 0.290512 0.241974 0.392457
chargesum: 0.00000
title: Mulliken charges with hydrogens summed into heavy atoms:
elementType: O O O O O N C C C C C C C C C C C C C C
charge: -0.191370 -0.038438 -0.239657 -0.203422 -0.203277 0.018610 0.257717 0.403407 0.001825 0.099022 -0.183233 -0.092372 -0.081037 0.381289 -0.044065 0.051278 0.022220 -0.079726 0.026220 0.095010
polarizability: 2.11994946e+02 -2.20321309e+01 1.81493508e+02 -2.54244330e+01 2.44215745e-01 1.38860780e+02
1716.lowfreq: -2.9886 -0.0011 -0.0009 -0.0006 2.2982 5.2475 21.9222 24.9775 46.3301
frequency: 21.8800 24.6317 46.3206 54.3480 81.9950 105.6034 119.0456 163.0493 169.0706 184.0031 237.8177 244.5339 291.3118 321.1291 369.3157 382.4669 412.9343 419.0270 428.7050 459.5087 506.8142 519.8986 577.7206 595.5332 598.0843 633.9047 653.5793 658.5121 687.7619 694.3221 711.3756 732.3574 765.2605 781.5643 792.6933 823.3499 833.8920 897.6378 936.9223 949.9688 968.6682 977.5828 989.0345 1007.3949 1009.7809 1012.9051 1042.0068 1085.3308 1087.4781 1104.1572 1158.7077 1164.5770 1173.0395 1180.4320 1214.9782 1257.6762 1280.4904 1296.8499 1327.4277 1372.0008 1380.3180 1399.4151 1427.7160 1430.9129 1469.3327 1476.8570 1557.3144 1575.4270 1590.0352 1600.7005 1612.9277 1628.3577 3140.8058 3152.3544 3154.5949 3167.9129 3169.9107 3171.7941 3183.4236 3186.4487 3532.1607
redmass: 7.3996 7.1773 7.4578 13.1438 10.4025 6.7062 5.7992 6.6094 7.1215 4.9263 5.5274 6.5323 6.0548 10.3415 8.0350 7.1408 3.3230 3.1689 6.9162 5.8202 6.0243 6.7396 4.3363 1.5081 2.9211 6.3914 6.5081 5.2517 3.4237 2.6763 8.3947 4.3621 5.7458 2.6629 2.0453 5.9174 1.6397 1.4677 4.3052 1.5810 1.3900 1.4111 6.0898 1.3860 4.4104 1.4130 2.3369 1.6991 1.8489 1.9668 2.5649 1.8534 1.1337 1.0732 7.3205 2.3574 1.4654 1.7742 2.7001 10.3365 10.2877 7.2495 2.3673 3.0373 2.6171 2.7074 10.2644 7.0159 7.2194 6.3074 7.2177 8.6244 1.0865 1.0880 1.0913 1.0967 1.0933 1.0927 1.0978 1.0972 1.0643
irintensity: 0.0589 3.8656 2.8401 1.1904 0.9282 1.1141 2.2167 3.4800 3.4632 1.8752 1.6108 0.5243 0.8659 6.5010 2.6696 12.8256 9.1592 0.4248 1.4985 8.3610 6.8226 2.7402 10.0474 90.6236 40.7661 19.2497 11.8044 1.4811 56.9862 67.8999 28.4604 26.2365 8.3013 31.0867 20.8316 12.3113 25.6429 1.1743 41.7877 7.4486 3.4992 2.5227 1.3781 8.0791 204.0321 14.5347 4.1116 28.7421 49.0187 62.8045 15.7540 63.7904 24.5732 0.4126 256.4754 112.9603 18.3742 76.9769 92.7386 102.4651 12.6826 10.3179 0.8556 34.8080 2.2634 8.8677 106.2776 29.7144 54.6056 24.1870 2.9140 239.5969 1.3491 5.6265 6.9704 12.7278 3.6522 3.6225 8.3650 3.7609 59.3245
temp: 298.150 k
press: 1.00000 atm
elementType: 8 8 8 8 8 7 6 6 6 6 6 6 6 6 6 6 6 6 6 6 1 1 1 1 1 1 1 1 1
symmnumber: 1
zpe: 529988.1 jmol-1
zpe.correction: 0.201862 hartree
zpe.thermalcorrener: 0.218629 hartree
zpe.thermalcorrenthalpy: 0.219573 hartree
zpe.thermalcorrgfe: 0.154957 hartree
zpe.sumelectzpe: -968.298879 hartree
zpe.sumelectthermal: -968.282112 hartree
zpe.sumelectthermalent: -968.281168 hartree
zpe.sumelectthermalfe: -968.345784 hartree
dipole: 2.3036 0.4018 0.2990
dipole: 2.3574
quadrupole: -107.5997 -127.6113 -101.1668
quadrupole: -25.3761 -5.2854 -2.1290
quadrupole: 4.5262 -15.4854 10.9591 -25.3761 -5.2854 -2.1290
hfenergy: -968.5007408 hartree
pointgroup: C01 [X(C14H9N1O5)]
dipole: 0.9141208 0.1562667 -0.0120668 debye
polarizability: 206.6230203|-30.6492621|179.6300419|-23.2516273|-9.0463388|146.0961711 unknown
InChI: InChI=1S/C14H9NO5/c16-13(9-4-3-5-10(8-9)15(19)20)11-6-1-2-7-12(11)14(17)18/h1-8,17H
charge 0 multiplicity 1
29 atoms
O  0.934653 2.395911 -1.590246
O  2.149619 -0.212236 2.838789
O  0.967133 1.456281 1.744139
O  -4.358605 -1.847351 0.81335
O  -2.279291 -2.70013 0.427495
N  -3.11814 -1.720018 0.480091
C  1.646538 0.227993 -0.824741
C  -0.801978 1.090084 -0.548266
C  0.617004 1.332161 -0.984406
C  2.125546 -0.246512 0.432755
C  -1.270366 -0.202094 -0.219182
C  2.167872 -0.337495 -2.013276
C  -1.698531 2.192162 -0.515477
C  -2.624235 -0.360411 0.138437
C  3.082798 -1.292701 0.4796
C  -3.046852 2.009188 -0.147987
C  3.117583 -1.381685 -1.960358
C  -3.526826 0.723686 0.184545
C  3.569731 -1.867133 -0.711418
C  1.678209 0.422157 1.683758
H  -0.61813 -1.079662 -0.244225
H  1.823372 0.046569 -2.978746
H  -1.309607 3.180565 -0.78001
H  3.441368 -1.632152 1.454844
H  -3.727452 2.865675 -0.11707
H  3.503291 -1.812077 -2.890602
H  -4.566677 0.546843 0.471824
H  4.305452 -2.676621 -0.668002
H  1.832014 0.290005 3.636386
