program: Gaussian 09
title: 000244681
version: EM64L-G09RevD.01
frameworkgroup: C1[X(C12H17NO5S)]
method: RPBEPBE
basis: SDD
operation: Freq
keyword: #p
keyword: freq=noraman
keyword: PBEPBE/SDD
title: #p freq=noraman PBEPBE/SDD
converged: NO YES NO NO
title: Mulliken charges:
elementType: S O O O O O N C C C C C C C C C C C C H H H H H H H H H H H H H H H H H
charge: 0.967073 -0.393762 -0.299173 -0.504929 -0.513717 -0.323995 -0.357798 -0.246012 -0.368707 -0.003898 -0.355095 -0.267022 -0.236243 -0.286810 0.337330 -0.683727 -0.223578 -0.203897 -0.213193 0.231711 0.226308 0.215611 0.267062 0.210304 0.247174 0.325464 0.225515 0.213332 0.350795 0.293173 0.206171 0.226297 0.211570 0.246214 0.243269 0.237183
chargesum: 0.00000
title: Mulliken charges with hydrogens summed into heavy atoms:
elementType: S O O O O O N C C C C C C C C C C C C
charge: 0.967073 -0.393762 -0.299173 -0.504929 -0.513717 -0.323995 -0.032334 0.212006 0.113966 -0.003898 0.102383 0.171825 0.114552 0.006363 0.337330 -0.039689 0.022637 0.039372 0.023990
polarizability: 1.97978484e+02 1.85061277e+01 1.92184165e+02 2.73453558e+00 -1.59100164e+01 1.45679023e+02
1716.lowfreq: -10.6106 -5.9586 -0.0018 0.0010 0.0014 6.8937 13.9031 25.1930 42.7537
frequency: 13.3302 24.8112 42.6534 47.7123 54.6859 63.3166 67.3993 86.6849 104.5741 123.3651 130.7540 174.8806 185.4607 215.2607 219.4224 242.7510 246.7881 268.1761 302.1346 317.6927 326.9369 360.6099 365.2848 407.6514 435.4993 477.6126 479.9938 524.4105 542.6302 569.8573 601.2474 632.7674 659.3432 690.2431 702.5370 752.8462 764.8909 792.1900 833.8485 854.9702 862.7640 880.7426 895.7356 900.4985 949.4064 951.9215 973.4186 981.1820 997.1097 1006.7804 1013.3187 1014.4712 1045.8165 1047.9563 1073.8017 1085.8985 1118.3091 1132.7075 1161.4182 1173.5972 1193.0358 1202.6497 1242.9515 1244.0243 1273.0780 1292.4617 1311.1070 1322.3401 1347.9330 1357.2504 1369.0041 1383.5922 1388.6237 1430.4242 1434.5038 1437.8975 1457.9051 1461.4192 1475.5544 1479.2067 1487.1094 1504.9064 1574.2547 1601.4158 1657.4739 2974.7377 2982.3394 2996.6515 3003.2162 3017.0619 3046.9794 3051.9066 3070.5980 3081.0342 3082.6297 3096.6480 3097.2824 3139.0384 3153.2575 3163.9718 3174.6580 3565.4995
redmass: 3.4818 3.3028 5.9609 3.9039 3.4905 4.5874 2.8176 6.5210 6.9159 5.2814 7.4416 5.9273 4.4014 2.3342 1.5595 3.7758 7.4349 2.8003 3.7553 3.7384 5.7271 5.5740 6.5597 2.9231 3.1453 7.9114 3.3395 5.7711 3.5605 1.2832 6.4819 4.3684 7.2760 2.7081 10.6606 1.1045 1.3438 2.7398 15.7854 2.9256 1.2347 1.6852 2.0618 2.0408 5.9524 1.5643 6.2888 3.8302 1.3608 4.7008 3.6154 1.3252 2.9759 2.0518 2.7300 1.6313 2.4219 3.6678 1.7459 1.0626 1.1426 1.6238 1.3875 1.2404 1.1246 1.1136 1.2708 1.2742 1.2159 1.2826 1.3651 7.9812 1.2064 1.0839 1.0985 2.2440 1.1121 1.8591 1.0523 1.0425 1.0897 1.8377 5.5433 6.7788 8.2953 1.0360 1.0579 1.0654 1.0611 1.0574 1.1003 1.1063 1.1023 1.0987 1.0975 1.1034 1.1015 1.0866 1.0904 1.0956 1.1010 1.0770
irintensity: 1.0373 0.5326 3.7994 0.6871 0.7823 0.4533 0.4850 1.1694 15.5261 0.6065 2.4622 12.5210 2.7314 0.8507 1.2526 4.4199 5.9165 1.7990 7.3443 17.3091 1.7153 13.5963 5.0694 0.0397 16.1090 58.0564 12.7928 83.9802 12.9034 134.6270 3.0814 18.4910 8.2350 27.2932 56.2408 6.2570 73.0598 22.8127 78.1213 8.2640 0.2836 18.9976 29.4516 7.5794 85.4129 13.9589 2.7606 78.3305 0.7044 2.9847 89.0904 2.5274 9.0383 10.4561 23.6018 2.6530 35.9320 79.1558 8.5297 0.8781 10.1935 130.1998 68.2632 31.9179 33.8789 5.0305 6.5499 1.7978 18.2552 1.2166 1.3802 9.8193 12.2117 19.7877 27.4825 22.8142 11.5788 15.5357 3.7961 11.7439 15.0704 272.6525 0.6219 2.3858 257.3574 37.0505 16.1721 69.9688 5.3239 56.7875 3.3957 19.2683 25.1623 36.3609 4.4510 149.3881 30.0382 2.2977 6.5110 3.5632 29.1008 39.6969
temp: 298.150 k
press: 1.00000 atm
elementType: 16 8 8 8 8 8 7 6 6 6 6 6 6 6 6 6 6 6 6 1 1 1 1 1 1 1 1 1 1 1 1 1 1 1 1 1
symmnumber: 1
zpe: 733321.1 jmol-1
zpe.correction: 0.279307 hartree
zpe.thermalcorrener: 0.300163 hartree
zpe.thermalcorrenthalpy: 0.301108 hartree
zpe.thermalcorrgfe: 0.226508 hartree
zpe.sumelectzpe: -1294.787014 hartree
zpe.sumelectthermal: -1294.766158 hartree
zpe.sumelectthermalent: -1294.765214 hartree
zpe.sumelectthermalfe: -1294.839814 hartree
dipole: -0.1311 0.8019 -2.0662
dipole: 2.2202
quadrupole: -107.3105 -101.7249 -128.5871
quadrupole: 13.7746 -5.6975 1.9159
quadrupole: 5.2303 10.8159 -16.0462 13.7746 -5.6975 1.9159
hfenergy: -1295.0663216 hartree
pointgroup: C01 [X(C12H17N1O5S1)]
dipole: 0.1414002 -0.3503741 -0.7875715 debye
polarizability: 189.7748383|17.1176383|202.4982338|-6.3995818|11.3770402|143.5685995 unknown
InChI: InChI=1S/C12H17NO5S/c1-2-9-17-12(14)13-8-10-18-19(15,16)11-6-4-3-5-7-11/h3-7,13H,2,8-10H2,1H3
charge 0 multiplicity 1
36 atoms
S  -1.107525 0.803962 1.02179
O  -1.082054 1.880849 -0.515406
O  3.602773 0.72166 -0.034339
O  -2.25183 1.313224 2.048331
O  0.416374 0.684514 1.568767
O  1.849696 0.174798 -1.518643
N  2.151815 2.34191 -0.653014
C  -0.258383 3.105655 -0.434196
C  1.009252 2.977118 -1.309133
C  -1.69171 -0.750569 0.138904
C  3.310989 -1.311187 1.363593
C  3.953696 -0.718471 0.101687
C  -0.859673 -1.315374 -0.841368
C  -2.937876 -1.263165 0.532814
C  2.461319 1.009153 -0.795618
C  3.671205 -2.805045 1.521739
C  -1.325997 -2.500569 -1.458439
C  -3.375706 -2.449283 -0.100161
C  -2.571469 -3.063134 -1.089433
H  -0.910975 3.912146 -0.819489
H  0.008568 3.340106 0.615183
H  1.308337 3.9914 -1.640097
H  0.755409 2.387949 -2.206976
H  3.653258 -0.740086 2.24689
H  2.214854 -1.179684 1.307875
H  2.691394 2.858199 0.042989
H  3.621291 -1.251096 -0.808093
H  5.055469 -0.725417 0.160351
H  0.095155 -0.854412 -1.127519
H  -3.534667 -0.756979 1.298196
H  4.765354 -2.953112 1.597024
H  3.212657 -3.222096 2.435784
H  3.307525 -3.398981 0.662084
H  -0.714048 -2.974238 -2.232848
H  -4.340158 -2.885823 0.178552
H  -2.918717 -3.980522 -1.577086
