program: Gaussian 09
title: 000244668
version: EM64L-G09RevD.01
frameworkgroup: C1[X(C9H19NO3)]
method: RPBEPBE
basis: SDD
operation: Freq
keyword: #p
keyword: freq=noraman
keyword: PBEPBE/SDD
title: #p freq=noraman PBEPBE/SDD
converged: YES YES NO NO
title: Mulliken charges:
elementType: O O O N C C C C C C C C C H H H H H H H H H H H H H H H H H H H
charge: -0.299007 -0.285256 -0.446369 -0.399599 -0.361009 -0.351539 -0.373312 -0.353999 -0.311530 -0.694444 0.294218 -0.371629 -0.308571 0.186012 0.196967 0.188519 0.193952 0.227621 0.203948 0.196946 0.194204 0.233815 0.220130 0.211341 0.209647 0.216327 0.235128 0.228587 0.329087 0.221133 0.229255 0.339427
chargesum: 0.00000
title: Mulliken charges with hydrogens summed into heavy atoms:
elementType: O O O N C C C C C C C C C
charge: -0.299007 -0.285256 -0.106943 -0.070511 0.021971 0.030931 0.058258 0.037150 0.142416 -0.057129 0.294218 0.092087 0.141817
polarizability: 1.49067278e+02 3.79374087e+00 9.98518035e+01 5.87387000e-01 1.57693007e+00 1.00009966e+02
1716.lowfreq: -14.3954 -4.1599 -0.0007 -0.0005 0.0005 6.9363 19.9826 25.3548 31.3871
frequency: 18.6046 24.8493 31.2747 59.4791 64.8639 69.9629 106.7508 115.5085 123.8166 133.5756 203.5616 224.9493 233.6262 252.9732 272.1984 326.8186 350.1862 416.0819 417.1377 495.1470 562.2134 569.4187 639.5760 703.2742 725.3459 747.8231 792.8552 823.1582 856.0970 880.7574 885.4838 895.4397 967.6936 990.3824 1007.4311 1014.6364 1042.9189 1065.6475 1081.7664 1082.9791 1115.7416 1124.2806 1166.7071 1174.5643 1203.6018 1204.9292 1235.6128 1254.8335 1269.4804 1283.1597 1288.7238 1292.6130 1297.3754 1329.3849 1339.9729 1355.9138 1356.9041 1371.8160 1373.7265 1389.8083 1434.3694 1451.8528 1464.4818 1465.7937 1469.3730 1473.4758 1476.8685 1477.5446 1482.5920 1488.3539 1661.3774 2953.0561 2957.3422 2968.2081 2971.7651 2987.6036 2990.9263 2992.5588 3006.4279 3007.5371 3017.8237 3030.0639 3050.5487 3067.9796 3071.4607 3078.7042 3090.7568 3096.3325 3551.1384 3577.7101
redmass: 2.5547 3.6715 2.4557 4.1531 3.6848 5.3024 2.3261 2.2937 2.3240 2.9941 3.3354 1.1168 3.8412 3.5853 2.6119 1.6344 2.0949 3.0996 2.8620 2.6968 1.5095 1.9673 4.6572 10.4152 1.0691 1.0980 1.2396 2.3947 3.0133 1.9408 1.4705 2.1760 2.8728 1.1751 3.7674 3.4851 3.4123 2.7638 2.1801 1.8979 3.9183 3.1710 1.7696 1.2688 1.8255 1.7149 1.2802 1.2726 1.2239 1.0492 1.1582 1.2117 1.1576 1.1628 1.4281 1.6484 1.3358 1.2870 1.2491 1.2171 1.1469 1.1142 1.0748 1.0754 1.0852 1.0929 1.0447 1.6053 1.1079 1.0930 8.3357 1.0590 1.0590 1.0594 1.0365 1.0622 1.0947 1.0650 1.1015 1.0611 1.0579 1.1040 1.1036 1.1008 1.0993 1.1008 1.1023 1.1084 1.0656 1.0779
irintensity: 0.3633 0.2067 0.3912 8.1616 3.2829 1.5724 3.0692 2.2071 0.0412 1.3489 6.8979 0.0666 1.7695 5.4218 30.0838 101.1243 84.1310 18.4904 2.4500 1.3201 34.3964 33.0167 6.1318 24.5959 11.8566 0.9041 6.6289 12.2993 19.1814 4.0415 7.8168 3.7865 131.4076 5.9315 21.4828 50.7343 29.5430 9.8157 0.7384 9.6135 134.7311 13.5225 13.7156 26.7094 160.1197 85.0482 7.0861 2.0134 33.5864 1.7034 0.3566 6.0473 0.1784 15.9974 0.3624 0.8596 11.6279 10.8030 21.2282 11.5642 37.0085 9.8767 4.9965 0.7130 10.2574 8.6465 17.4794 274.7474 18.6072 34.4571 224.3114 1.3394 10.9164 85.6915 35.9875 25.0443 5.3086 32.2668 0.9421 33.6194 51.8453 33.7743 37.4723 92.8796 54.3940 18.3390 41.8442 33.6221 1.9310 41.6112
temp: 298.150 k
press: 1.00000 atm
elementType: 8 8 8 7 6 6 6 6 6 6 6 6 6 1 1 1 1 1 1 1 1 1 1 1 1 1 1 1 1 1 1 1
symmnumber: 1
zpe: 726847.7 jmol-1
zpe.correction: 0.276842 hartree
zpe.thermalcorrener: 0.293415 hartree
zpe.thermalcorrenthalpy: 0.294359 hartree
zpe.thermalcorrgfe: 0.229075 hartree
zpe.sumelectzpe: -633.706653 hartree
zpe.sumelectthermal: -633.690080 hartree
zpe.sumelectthermalent: -633.689136 hartree
zpe.sumelectthermalfe: -633.754420 hartree
dipole: -1.0114 -1.7779 -1.2961
dipole: 2.4215
quadrupole: -77.2965 -85.3459 -82.2269
quadrupole: -7.6985 0.9848 3.1216
quadrupole: 4.3266 -3.7228 -0.6038 -7.6985 0.9848 3.1216
hfenergy: -633.983495 hartree
pointgroup: C01 [X(C9H19N1O3)]
dipole: -0.4053765 0.5299208 0.6800477 debye
polarizability: 149.0498352|-3.8962432|99.0680256|-0.7989417|1.2282637|100.8111871 unknown
InChI: InChI=1S/C9H19NO3/c1-2-3-4-5-8-13-9(12)10-6-7-11/h10-11H,2-8H2,1H3
charge 0 multiplicity 1
32 atoms
O  0.840792 1.147786 1.154429
O  1.481158 0.905025 -1.111162
O  4.056506 -2.29678 0.253707
N  2.951099 0.455453 0.664534
C  -2.877801 0.714889 0.168428
C  -3.81717 -0.500762 -0.000087
C  -1.431809 0.309979 0.539357
C  -5.262445 -0.104174 -0.378149
C  -0.529258 1.537629 0.717215
C  -6.197934 -1.321562 -0.540813
C  1.74195 0.836572 0.118788
C  4.114315 0.154945 -0.190196
C  4.046954 -1.263517 -0.790083
H  -3.28917 1.387197 0.950614
H  -2.867147 1.300137 -0.774538
H  -3.833795 -1.086893 0.942604
H  -3.40701 -1.176265 -0.779279
H  -1.011098 -0.334955 -0.255613
H  -1.436385 -0.278305 1.477831
H  -5.244918 0.47845 -1.321793
H  -5.669158 0.574999 0.3990
H  -0.449956 2.110306 -0.224833
H  -0.887198 2.192406 1.529616
H  -5.829982 -2.001329 -1.332496
H  -6.258946 -1.904003 0.398104
H  -7.223575 -1.011006 -0.812467
H  4.170015 0.895711 -1.010113
H  5.020831 0.245737 0.43336
H  3.052587 0.517152 1.677592
H  4.948711 -1.45561 -1.394569
H  3.153345 -1.351597 -1.439681
H  3.235192 -2.186016 0.79799
