program: Gaussian 09
title: 000244663
version: EM64L-G09RevD.01
frameworkgroup: C1[X(C7H15NO)]
method: RPBEPBE
basis: SDD
operation: Freq
keyword: #p
keyword: freq=noraman
keyword: PBEPBE/SDD
title: #p freq=noraman PBEPBE/SDD
converged: YES YES NO NO
title: Mulliken charges:
elementType: O N C C C C C C C H H H H H H H H H H H H H H H
charge: -0.267288 -0.304943 -0.371024 -0.344926 -0.347100 -0.353652 -0.409617 -0.692655 -0.049479 0.187154 0.186449 0.192676 0.187876 0.220715 0.199051 0.193197 0.193815 0.211426 0.261470 0.210411 0.211265 0.216159 0.302690 0.166332
chargesum: 0.00000
title: Mulliken charges with hydrogens summed into heavy atoms:
elementType: O N C C C C C C C
charge: -0.267288 -0.002253 0.002579 0.035626 0.072665 0.033360 0.063279 -0.054820 0.116853
polarizability: 1.06252517e+02 -2.29115914e+00 7.75118316e+01 -7.54486195e+00 -2.31570581e+00 7.50017419e+01
1716.lowfreq: -19.5014 -6.5724 -0.0005 0.0004 0.0007 10.1124 18.1874 42.2794 54.3634
frequency: 15.7689 41.9841 54.1793 101.9811 123.1660 136.4415 200.6662 230.2729 263.3712 311.5297 350.0687 416.8754 525.8112 570.5623 705.0503 722.2260 743.6163 806.8579 878.8640 892.3484 902.0904 962.1556 973.5219 1024.4468 1033.7939 1077.8221 1079.2491 1116.9773 1134.6859 1188.5353 1199.4657 1230.7594 1255.4584 1276.8490 1283.9986 1291.7117 1314.1012 1348.1520 1350.6942 1361.8256 1368.6949 1390.0966 1453.1972 1456.2501 1463.2683 1469.4283 1477.3069 1478.1641 1480.6224 1487.5786 1642.6218 2925.4192 2946.1827 2956.8225 2966.8994 2973.4948 2977.2524 2986.6526 2990.5546 3003.1260 3029.2942 3046.9905 3069.7576 3072.7073 3075.5593 3545.9628
redmass: 6.1230 1.9228 3.0570 2.6310 1.8499 2.6999 3.3941 1.1173 2.6423 2.2676 3.4540 2.8450 2.4626 1.1546 2.7436 1.1219 1.2422 1.4468 1.7916 1.8956 2.1183 1.5667 1.3035 3.7001 2.1937 2.2571 2.3198 2.2318 1.8372 2.1121 1.5174 1.3572 1.2596 1.2369 1.0533 1.1410 1.2991 1.4349 1.5902 1.3745 1.2242 1.2158 1.1221 1.0873 1.0742 1.0782 1.0430 1.2681 1.3152 1.0873 5.5834 1.0863 1.0585 1.0589 1.0594 1.0362 1.0620 1.0946 1.0671 1.1005 1.1034 1.1015 1.1006 1.0993 1.0993 1.0781
irintensity: 8.9265 1.9271 3.6587 1.0505 0.3752 4.0885 7.9268 0.0329 36.6538 5.5104 2.9714 7.9330 2.7188 118.8909 0.4217 15.0524 1.4314 9.1258 1.1219 11.5337 1.2318 0.9556 1.6279 1.9608 6.7938 10.5782 0.8219 5.7508 5.0765 36.1789 1.5541 13.7963 4.4248 17.2676 0.0944 3.9268 6.8166 0.3381 0.5074 12.9302 11.5572 11.9813 42.9108 5.8333 1.7873 0.8379 11.2007 62.0693 51.3252 21.0075 275.5271 120.1547 13.8042 3.6091 73.7699 33.0359 57.7180 10.6182 28.9467 0.7719 21.7201 95.4886 90.0390 51.4931 9.3292 11.5770
temp: 298.150 k
press: 1.00000 atm
elementType: 8 7 6 6 6 6 6 6 6 1 1 1 1 1 1 1 1 1 1 1 1 1 1 1
symmnumber: 1
zpe: 557650.2 jmol-1
zpe.correction: 0.212398 hartree
zpe.thermalcorrener: 0.223895 hartree
zpe.thermalcorrenthalpy: 0.224839 hartree
zpe.thermalcorrgfe: 0.172725 hartree
zpe.sumelectzpe: -404.974402 hartree
zpe.sumelectthermal: -404.962905 hartree
zpe.sumelectthermalent: -404.961961 hartree
zpe.sumelectthermalfe: -405.014075 hartree
dipole: -3.2834 -0.7827 2.8869
dipole: 4.4416
quadrupole: -75.8887 -52.7564 -58.0812
quadrupole: -3.1399 9.5052 -1.2680
quadrupole: -13.6466 9.4857 4.1609 -3.1399 9.5052 -1.2680
hfenergy: -405.1867999 hartree
pointgroup: C01 [X(C7H15N1O1)]
dipole: -1.30396 0.3454706 1.1108165 debye
dipolederiv: -0.8142397 0.1933701 0.1951704 0.0708661 -0.4376794 0.0517651 0.5509376 -0.1758862 -0.7588776 -1.0470757 0.2578226 0.0035438 0.3957859 -0.6459847 -0.1787418 -0.0430168 -0.1076712 -0.3722426 -0.0557831 -0.0678041 -0.0134154 -0.0782034 0.1750878 0.0073081 0.002586 0.0249946 0.0607654 -0.0131823 -0.0486042 0.0131307 -0.0380647 0.1653709 -0.0024921 0.0488987 -0.0030952 0.0796183 0.0026373 -0.0404385 -0.0315222 -0.0174607 0.0864722 -0.0362184 -0.0857604 -0.010014 0.0882476 0.0300502 -0.0360182 -0.0042927 -0.0412771 0.1674016 -0.0005844 -0.0475657 -0.0047758 0.1018242 0.2210477 -0.0326702 0.1472901 -0.1755562 0.3933346 0.0056207 0.3270293 -0.0944838 0.238162 -0.0693533 -0.0409704 -0.0314263 -0.0424597 0.0838902 -0.0097281 0.006477 -0.0040306 0.0580414 1.2425405 -0.5898547 -0.4229101 -0.6086309 0.6015657 -0.0356664 -0.696309 0.0872258 0.8691644 0.0498906 0.0351703 -0.0431033 0.0585175 -0.0724662 0.129536 -0.0501778 0.1129627 -0.0641486 0.0360081 0.0135913 0.0265709 0.017026 -0.1040988 -0.1372953 0.0165645 -0.1159318 -0.0423409 0.0337575 0.0242011 0.0332808 0.0160472 -0.0891745 -0.1320101 0.0172602 -0.1090933 -0.03613 0.0152309 0.0363592 -0.0385223 0.040225 -0.071052 0.1350587 -0.0425644 0.1110639 -0.0484415 0.0314807 0.0064913 0.0230138 0.0011491 -0.070562 -0.1230535 0.0341574 -0.0833928 -0.0015501 -0.0097281 0.0749718 -0.0588248 0.0417831 -0.0579966 0.1330487 -0.0409239 0.1231351 -0.0318614 0.0033621 0.0613454 -0.0708381 0.0431017 -0.0647586 0.1374868 -0.0365379 0.114528 -0.0507881 0.030911 -0.0059494 0.0083153 0.0151785 -0.1042624 -0.1528375 0.025882 -0.1170666 -0.0394599 0.0460383 0.0815657 -0.0099371 0.0650087 -0.1206673 -0.0808914 -0.0684741 -0.1152522 -0.015563 -0.0280819 -0.073255 0.0723482 -0.0046546 0.0950311 0.0048726 0.019883 0.0718292 0.0262355 0.0558126 0.0266375 -0.0437485 0.0759875 -0.0664249 0.1294758 -0.0892884 0.1067999 -0.0153893 0.0707571 0.051366 0.0245272 0.0015724 -0.0903242 -0.1306348 -0.024664 -0.1307596 -0.0044156 -0.1368035 -0.0559735 0.1094601 -0.0594662 0.0859556 0.0263742 0.1475255 0.035553 -0.0231519 0.2461789 0.074638 0.1044992 0.1151627 0.1838466 0.095805 0.0863947 0.0804156 0.1397379 0.058544 0.0540079 0.0073901 0.1083621 -0.0425049 0.163802 -0.0583136 0.2029454 -0.157436 unknown
polarizability: 106.5008323|-5.5187483|74.4338146|-4.8482906|-2.183773|77.8314435 unknown
InChI: InChI=1S/C7H15NO/c1-2-3-4-5-6-8-7-9/h7-8H,2-6H2,1H3
charge 0 multiplicity 1
24 atoms
O  3.898918 -0.610146 -0.646559
N  2.217778 0.092078 0.831029
C  -0.836675 0.427513 0.270189
C  -2.164041 0.059902 -0.431078
C  0.316447 0.696954 -0.722836
C  -3.319788 -0.22453 0.555447
C  1.641804 1.126505 -0.050398
C  -4.641339 -0.589446 -0.154746
C  3.291082 -0.694264 0.457342
H  -0.554278 -0.399324 0.955361
H  -0.995335 1.326095 0.904218
H  -2.00406 -0.830867 -1.073648
H  -2.459491 0.884966 -1.112377
H  0.504189 -0.20473 -1.337616
H  0.014429 1.503046 -1.422375
H  -3.023866 -1.050302 1.234544
H  -3.478071 0.665586 1.198424
H  1.483927 2.049762 0.541208
H  2.403984 1.336663 -0.820569
H  -4.975426 0.231488 -0.816952
H  -4.51884 -1.494411 -0.779311
H  -5.450544 -0.787754 0.571906
H  1.787988 -0.075025 1.742771
H  3.575305 -1.423858 1.251324
