program: Gaussian 09
title: 000244656
version: EM64L-G09RevD.01
frameworkgroup: C1[X(C8H16N3PS)]
method: RPBEPBE
basis: SDD
operation: Freq
keyword: #p
keyword: freq=noraman
keyword: PBEPBE/SDD
title: #p freq=noraman PBEPBE/SDD
converged: NO YES NO NO
title: Mulliken charges:
elementType: S P N N N C C C C C C C C H H H H H H H H H H H H H H H H
charge: -0.301843 0.684951 -0.356706 -0.349124 -0.467496 -0.396573 -0.380553 -0.387380 -0.392888 -0.312770 -0.346075 -0.439842 -0.427790 0.247274 0.263339 0.248614 0.248392 0.260075 0.248963 0.248508 0.254357 0.262346 0.220242 0.213548 0.260640 0.230661 0.219035 0.219131 0.228964
chargesum: 0.00000
title: Mulliken charges with hydrogens summed into heavy atoms:
elementType: S P N N N C C C C C C C C
charge: -0.301843 0.684951 -0.356706 -0.349124 -0.467496 0.114040 0.116453 0.121658 0.109977 0.169818 0.128112 0.009855 0.020305
polarizability: 1.56730662e+02 1.80640924e-01 1.38126958e+02 -3.11370124e-01 -1.85293394e-02 1.37413105e+02
1716.lowfreq: -46.3205 -0.0014 -0.0012 0.0007 8.8830 12.3511 19.9255 25.2134 49.5231
frequency: -46.1586 25.0695 49.4774 54.5705 68.7778 121.4644 128.9127 140.9112 156.5417 170.7500 257.5157 291.8841 304.6859 337.7165 352.9317 363.0286 398.5715 551.6640 571.4415 607.9995 632.5465 708.0912 790.3873 802.1260 804.3725 812.1180 824.2675 849.4820 879.2676 886.7800 893.7016 948.5272 951.2877 991.9879 999.1819 1026.4539 1067.9984 1073.9361 1083.0796 1097.6551 1114.1015 1118.3661 1120.6715 1125.2197 1142.3848 1148.9476 1154.9193 1192.3575 1204.3698 1230.7904 1233.6954 1237.1121 1258.3256 1295.4664 1302.8349 1319.5280 1338.4896 1442.2854 1444.0513 1456.4330 1460.2664 1468.0136 1475.2257 1483.3074 1492.1822 2962.2589 2970.9093 3008.8735 3024.0796 3059.8498 3062.8722 3064.3044 3068.7566 3070.0226 3070.8115 3083.6900 3096.2735 3176.9938 3179.3629 3193.3559 3195.6534
redmass: 1.6599 3.2689 3.3680 3.1626 3.5363 4.5314 3.4921 3.9205 4.6137 3.5476 2.3552 3.7445 4.0231 5.0115 4.4830 4.2288 6.7692 6.6624 9.8870 10.5387 2.8007 1.7037 8.6879 4.3445 1.2975 1.1214 2.0424 1.5000 4.2204 2.9909 4.3907 1.7105 2.1575 1.0636 1.0720 3.1906 1.2500 1.5297 1.6354 1.6729 1.3167 1.2902 1.3132 1.2959 6.1877 1.3776 1.3667 1.3030 1.1847 3.3819 1.1967 3.2286 1.4142 1.3261 1.3192 1.2760 1.4136 1.0759 1.0747 1.1715 1.1695 1.0807 1.0790 1.0827 1.0876 1.0680 1.0689 1.0587 1.0626 1.0995 1.0506 1.0519 1.0591 1.0991 1.0613 1.0991 1.1043 1.1162 1.1163 1.1163 1.1163
irintensity: 0.0127 0.5253 0.6766 1.4200 2.0027 2.1288 2.6513 1.9931 7.7980 7.7111 6.6267 1.5289 7.5264 1.2169 1.0300 6.5080 0.7852 39.3178 60.9182 92.2387 0.4739 27.0446 2.8177 19.1386 36.8310 27.7406 3.1007 2.6278 148.9569 14.9217 73.0614 24.5226 2.6416 0.6214 5.0501 103.2889 2.2859 22.4781 106.3850 2.1473 3.0012 2.8282 12.7563 8.0190 32.5289 0.0178 0.1615 4.9908 13.3140 55.1887 12.7183 26.3138 16.3137 3.0604 5.2717 3.2948 13.5074 7.5252 11.6070 0.1724 6.6822 0.8586 11.8253 10.9353 1.1892 57.0245 66.3069 33.1024 68.3576 7.6107 12.6379 15.2441 42.1077 5.2116 19.0391 14.3729 59.9364 0.9410 1.6218 10.4815 12.8694
temp: 298.150 k
press: 1.00000 atm
elementType: 16 15 7 7 7 6 6 6 6 6 6 6 6 1 1 1 1 1 1 1 1 1 1 1 1 1 1 1 1
symmnumber: 1
zpe: 625793.9 jmol-1
zpe.correction: 0.238352 hartree
zpe.thermalcorrener: 0.252546 hartree
zpe.thermalcorrenthalpy: 0.253490 hartree
zpe.thermalcorrgfe: 0.195534 hartree
zpe.sumelectzpe: -1216.855723 hartree
zpe.sumelectthermal: -1216.841529 hartree
zpe.sumelectthermalent: -1216.840584 hartree
zpe.sumelectthermalfe: -1216.898541 hartree
dipole: 0.9499 0.1910 -1.9074
dipole: 2.1394
quadrupole: -84.0394 -85.8203 -102.7976
quadrupole: -0.3700 4.8556 -0.2509
quadrupole: 6.8464 5.0654 -11.9118 -0.3700 4.8556 -0.2509
hfenergy: -1217.0940748 hartree
pointgroup: C01 [X(C8H16N3P1S1)]
dipole: 0.3629527 0.0261447 -0.758975 debye
polarizability: 155.8102842|3.9987894|139.0027137|-0.6379613|-0.280858|137.4577274 unknown
InChI: InChI=1S/C8H16N3PS/c13-12(10-5-6-10,11-7-8-11)9-3-1-2-4-9/h1-8H2
charge 0 multiplicity 1
29 atoms
S  -1.304298 0.121034 2.123757
P  -0.56142 -0.176872 0.179226
N  -0.923591 1.103657 -1.040082
N  -1.19775 -1.588248 -0.743353
N  1.137892 -0.374422 0.090937
C  -1.121799 2.514116 -0.519702
C  -2.308237 1.722925 -1.036157
C  -1.456919 -2.855699 0.048648
C  -2.622884 -2.030781 -0.460432
C  1.900262 -0.423448 -1.179409
C  2.080216 -0.203582 1.214637
C  3.102888 0.539507 -0.93162
C  3.201112 0.70497 0.624385
H  -0.661519 3.286766 -1.142414
H  -1.066204 2.666283 0.566938
H  -3.025948 1.373064 -0.282089
H  -2.714381 1.915959 -2.033466
H  -1.268364 -2.829517 1.130229
H  -1.159018 -3.770734 -0.471257
H  -3.177551 -2.343699 -1.349731
H  -3.189476 -1.470147 0.295609
H  1.260301 -0.117566 -2.022416
H  2.254303 -1.457642 -1.363676
H  2.494361 -1.187355 1.51671
H  1.564375 0.233685 2.086107
H  2.912581 1.515713 -1.409641
H  4.032323 0.12865 -1.363638
H  4.192664 0.411866 1.01147
H  3.026581 1.756915 0.909429
