program: Gaussian 09
title: 000244655
version: EM64L-G09RevD.01
frameworkgroup: C1[X(C18H23N2O2P)]
method: RPBEPBE
basis: SDD
operation: Freq
keyword: #p
keyword: freq=noraman
keyword: PBEPBE/SDD
title: #p freq=noraman PBEPBE/SDD
converged: YES YES NO NO
title: Mulliken charges:
elementType: P O O N N C C C C C C C C C C C C C C C C C C H H H H H H H H H H H H H H H H H H H H H H H
charge: 1.232043 -0.554696 -0.606543 -0.446902 -0.461123 -0.007059 -0.037004 -0.473934 -0.442580 -0.394247 -0.387850 -0.673299 -0.680100 0.366333 -0.549511 -0.409845 0.398637 -0.401478 0.374073 -0.412814 -0.411375 -0.244663 -0.243851 0.270628 0.272283 0.272947 0.248038 0.265042 0.241875 0.202482 0.209333 0.200840 0.210938 0.216102 0.234144 0.212572 0.209108 0.246894 0.213435 0.315601 0.250692 0.238334 0.245039 0.237230 0.227409 0.226820
chargesum: 0.00000
title: Mulliken charges with hydrogens summed into heavy atoms:
elementType: P O O N N C C C C C C C C C C C C C C C C C C
charge: 1.232043 -0.554696 -0.606543 -0.446902 -0.461123 0.263569 0.235278 0.047051 0.064337 0.017569 0.023928 -0.010481 -0.010663 0.366333 -0.233910 -0.159153 0.398637 -0.163144 0.374073 -0.167775 -0.174145 -0.017254 -0.017030
polarizability: 3.24158018e+02 9.54000778e+00 1.92870620e+02 1.47575194e+01 1.35435132e+01 2.17191354e+02
1716.lowfreq: -10.2308 -8.2280 -5.0917 -0.0014 -0.0012 -0.0009 8.9226 11.1321 22.4322
frequency: 7.7382 9.9028 21.8719 32.7684 47.0005 58.9261 73.8090 79.9602 89.8727 104.9066 120.1333 146.2679 173.9104 182.0265 195.2936 217.2130 222.4521 231.8297 262.4858 275.8072 300.4945 317.1077 336.3496 364.9304 383.3545 401.4469 402.7065 421.7631 440.2033 474.4600 480.0961 491.1729 511.1826 532.2655 561.2537 603.3975 621.3966 631.0910 648.7210 723.2143 745.5569 754.5822 758.6424 759.0590 783.1750 797.2809 802.6652 823.3071 829.7046 843.6668 874.1648 896.2828 907.3812 922.8221 937.5200 949.0172 953.6480 955.9847 957.3367 972.3635 990.4200 1015.3849 1022.9796 1023.3793 1028.0007 1049.7122 1053.4775 1088.6479 1089.6043 1115.7339 1118.6525 1125.6686 1135.2390 1136.8829 1144.6784 1155.7511 1169.6836 1172.1784 1173.0045 1233.2188 1236.1765 1245.2334 1255.6951 1260.8545 1262.8634 1274.9743 1307.8510 1309.4426 1350.6834 1386.2253 1386.4868 1398.1138 1400.4077 1408.4684 1422.4524 1437.0269 1452.8685 1454.5930 1456.6939 1459.5892 1460.2902 1476.0040 1476.6230 1485.0125 1486.6060 1514.1384 1581.3969 1598.2093 1635.2572 2981.9554 2981.9902 2984.7331 2984.9483 3039.8452 3041.1213 3075.5759 3076.5292 3078.9951 3083.6128 3084.3726 3086.6356 3090.1927 3090.5953 3118.7905 3125.7944 3127.9690 3142.2336 3143.5681 3161.3648 3166.2009 3190.3597 3193.8136
redmass: 3.2305 4.8949 3.7206 3.7418 4.1167 3.5106 2.6506 3.3603 3.3192 4.4596 3.3320 4.6411 3.2843 3.6963 1.8899 5.8289 1.3595 1.7517 3.9594 3.8959 4.4824 4.1960 3.0703 4.4740 2.9157 3.1968 2.8256 4.8028 4.0960 3.8411 2.9227 5.0518 6.2387 3.6246 5.3118 8.3077 6.8648 5.9066 2.9718 3.2093 2.3349 6.3276 1.4521 3.7949 2.6720 1.3307 1.3130 1.3886 2.3813 2.9857 1.5196 5.3886 4.9376 1.5251 3.0667 4.1488 1.4044 1.3712 1.2270 1.4081 1.3418 3.9405 1.7063 1.7751 1.6113 1.8259 2.2401 1.6086 1.5870 1.5967 1.3972 1.3200 1.4370 1.4301 1.2737 1.8234 1.9453 1.8617 1.1139 2.2904 1.7347 1.7495 1.6573 1.2195 1.2195 1.8145 1.3471 1.3457 1.7742 1.4010 1.4591 1.5746 1.5320 5.1071 4.1885 3.3049 1.0877 1.0860 2.1392 1.1892 1.1784 1.0479 1.0436 1.0592 1.0606 3.7824 7.6338 5.6585 6.7232 1.0511 1.0410 1.0469 1.0550 1.0984 1.0986 1.0862 1.0964 1.0669 1.0911 1.0676 1.0804 1.1000 1.0993 1.0861 1.0886 1.0887 1.0949 1.0935 1.1004 1.0960 1.1178 1.1183
irintensity: 0.5634 0.1541 0.3200 0.1827 0.5991 2.3899 3.0907 2.3043 1.2994 2.1597 1.3893 5.0889 5.5067 1.7908 1.3451 1.6119 1.7470 4.4273 5.0981 3.7849 0.9365 14.1121 11.2769 3.3995 5.3643 0.9139 7.4453 15.1004 6.0941 6.5686 39.7206 6.1159 14.4391 2.2992 9.0796 146.1722 40.4156 89.6202 0.1494 26.5069 11.6938 144.1014 32.8753 19.9756 1.3909 13.4687 9.9860 41.7402 117.8970 57.9773 23.9304 120.8968 79.4678 37.9970 179.9904 54.8334 11.1612 9.2249 13.3803 8.7111 0.3378 40.6257 2.1579 2.2221 35.2214 5.9493 28.0860 4.5541 4.6661 38.6400 3.5074 5.9667 8.6203 1.0938 5.4825 182.9504 13.9228 6.5673 10.4636 48.7036 43.0170 63.2303 46.4675 0.5414 0.1632 11.9238 18.3670 3.5753 11.4783 12.1097 17.5043 7.3801 17.2915 24.5548 2.3296 1.4849 8.9014 6.7315 64.3805 20.4373 12.0671 10.3550 11.5027 27.5195 19.2063 45.9244 10.7527 89.0692 61.7702 43.8541 34.9064 29.1255 16.4541 5.2274 5.6570 10.3830 20.4182 36.2218 28.9406 40.5820 19.0974 51.8589 37.1712 3.1699 1.0442 9.8786 33.9494 0.3878 40.7266 7.3526 4.0219 8.3369
temp: 298.150 k
press: 1.00000 atm
elementType: 15 8 8 7 7 6 6 6 6 6 6 6 6 6 6 6 6 6 6 6 6 6 6 1 1 1 1 1 1 1 1 1 1 1 1 1 1 1 1 1 1 1 1 1 1 1
symmnumber: 1
zpe: 977341.1 jmol-1
zpe.correction: 0.372250 hartree
zpe.thermalcorrener: 0.396076 hartree
zpe.thermalcorrenthalpy: 0.397020 hartree
zpe.thermalcorrgfe: 0.314355 hartree
zpe.sumelectzpe: -1299.106132 hartree
zpe.sumelectthermal: -1299.082306 hartree
zpe.sumelectthermalent: -1299.081362 hartree
zpe.sumelectthermalfe: -1299.164027 hartree
dipole: 0.3050 1.4348 1.9991
dipole: 2.4795
quadrupole: -129.7868 -137.8601 -139.9032
quadrupole: -1.7635 4.6286 -3.8726
quadrupole: 6.0632 -2.0101 -4.0531 -1.7635 4.6286 -3.8726
hfenergy: -1299.4783818 hartree
pointgroup: C01 [X(C18H23N2O2P1)]
dipole: -0.0093136 -0.1236867 0.9675985 debye
polarizability: 318.7978987|6.8533166|187.3704597|-28.1824783|1.4576705|228.051633 unknown
InChI: InChI=1S/C18H23N2O2P/c1-3-16-12-19(16)23(21,20-13-17(20)4-2)22-18-10-9-14-7-5-6-8-15(14)11-18/h5-11,16-17H,3-4,12-13H2,1-2H3
charge 0 multiplicity 1
46 atoms
P  -2.104623 -0.731289 -0.258771
O  -0.941023 0.320921 0.571382
O  -1.876845 -0.888101 -1.83366
N  -2.028815 -2.198179 0.748037
N  -3.635687 -0.040743 0.205788
C  -0.93961 -3.227345 0.429179
C  -3.897088 1.452148 0.217525
C  -2.376649 -3.5114 0.049223
C  -3.868141 0.665314 1.520591
C  -0.270783 -3.853094 1.640604
C  -5.180724 1.901502 -0.457786
C  0.808674 -2.93422 2.253444
C  -5.025594 1.970499 -1.993263
C  0.430372 0.457059 0.237458
C  0.955132 0.212976 -1.034394
C  1.25971 0.910747 1.312204
C  2.357652 0.402583 -1.267154
C  2.621565 1.110232 1.095321
C  3.211811 0.859417 -0.188499
C  2.943332 0.155387 -2.554136
C  4.611035 1.048192 -0.436064
C  4.310869 0.347415 -2.765679
C  5.153616 0.797022 -1.698882
H  -0.270908 -2.975567 -0.407564
H  -3.017747 2.088533 0.03761
H  -2.642223 -3.463829 -1.014267
H  -2.980686 -4.18208 0.668291
H  -3.006516 0.802951 2.183022
H  -4.808501 0.386428 2.007565
H  0.178256 -4.818149 1.329386
H  -1.045001 -4.082107 2.396973
H  -5.461411 2.895044 -0.053475
H  -5.990945 1.197389 -0.19074
H  1.602096 -2.698201 1.520191
H  0.358964 -1.980449 2.581535
H  1.285414 -3.411305 3.128563
H  -4.243051 2.695516 -2.285161
H  -4.737274 0.983095 -2.395283
H  -5.970693 2.279736 -2.474493
H  0.30005 -0.113393 -1.849294
H  0.798667 1.091135 2.287991
H  3.259735 1.45923 1.91576
H  2.297828 -0.187322 -3.37141
H  5.252316 1.394242 0.383763
H  4.745735 0.155036 -3.752813
H  6.224212 0.943532 -1.879219
