program: Gaussian 09
title: 000244649
version: EM64L-G09RevD.01
frameworkgroup: C1[X(C20H22N4O2)]
method: RPBEPBE
basis: SDD
operation: Freq
keyword: #p
keyword: freq=noraman
keyword: PBEPBE/SDD
title: #p freq=noraman PBEPBE/SDD
converged: YES YES NO NO
title: Mulliken charges:
elementType: O O N N N N C C C C C C C C C C C C C C C C C C C C H H H H H H H H H H H H H H H H H H H H H H
charge: -0.236463 -0.236469 0.073697 0.073752 -0.369630 -0.369554 -0.557177 -0.557068 0.477351 0.476828 -0.437121 -0.437279 -0.421595 -0.421327 -0.393948 -0.393842 -0.212302 -0.212027 -0.222869 -0.222644 -0.225562 -0.225448 -0.240905 -0.241177 0.129633 0.129464 0.226372 0.223482 0.226834 0.223378 0.245042 0.217911 0.217599 0.245005 0.238556 0.238677 0.231959 0.231857 0.231927 0.231631 0.228462 0.228435 0.226322 0.226285 0.230400 0.230459 0.336513 0.336575
chargesum: 0.00000
title: Mulliken charges with hydrogens summed into heavy atoms:
elementType: O O N N N N C C C C C C C C C C C C C C C C C C C C
charge: -0.236463 -0.236469 0.073697 0.073752 -0.033118 -0.032979 -0.107323 -0.106857 0.477351 0.476828 0.025832 0.025325 -0.183038 -0.182649 -0.161989 -0.161985 0.019625 0.019604 0.005593 0.005792 0.000760 0.000837 -0.010505 -0.010718 0.129633 0.129464
polarizability: 4.05203775e+02 -2.71671843e+01 2.45701297e+02 5.15752827e-01 -5.58472187e-01 1.64576289e+02
1716.lowfreq: -11.1701 -8.3965 -0.0010 -0.0003 0.0003 0.6637 4.8042 15.6525 21.3801
frequency: -8.3344 14.0428 21.3795 23.0978 23.4404 32.0763 33.4205 52.7939 74.4769 82.6399 98.8793 138.1008 143.3824 143.6376 158.7918 199.7877 220.4811 234.1567 250.1588 299.3717 312.4398 333.3633 342.4509 354.9703 361.9368 403.1948 403.3084 438.8983 445.2860 468.2188 479.7403 493.2066 506.4552 510.7591 569.4644 570.9651 582.5506 617.0835 617.2074 705.6008 705.8228 748.6985 752.6655 753.7052 761.8215 764.2057 766.5063 774.4068 780.7113 835.9920 855.1361 856.1762 866.1885 912.7120 914.4157 920.4536 926.9665 938.4077 939.1676 960.7271 977.8648 978.1164 989.7371 989.8834 996.5073 996.5645 998.2037 999.3524 1009.5334 1026.9280 1027.5505 1056.5244 1082.5100 1084.0999 1109.8158 1122.1035 1155.2379 1155.6602 1172.7363 1172.7643 1178.4777 1187.4658 1187.7160 1190.3136 1207.6674 1208.0421 1233.1495 1233.7431 1292.7859 1293.2561 1318.3080 1320.9797 1330.9142 1331.1204 1347.9795 1355.3114 1381.2734 1381.4190 1439.5648 1439.5933 1446.2131 1446.6641 1475.9214 1476.0590 1483.9715 1484.2521 1503.0063 1505.5690 1592.3799 1592.4675 1602.4112 1604.0983 1613.5356 1613.7533 1636.5445 1646.7706 2978.3733 2978.8354 2989.9241 2990.3420 2993.8431 2994.0638 3054.7086 3054.7374 3072.1966 3072.3024 3112.6226 3113.1628 3117.5023 3117.9105 3133.0300 3133.1266 3144.7934 3144.8968 3163.6565 3163.6921 3326.2108 3327.0522
redmass: 5.5020 5.5509 5.1986 4.2839 4.3813 4.9712 6.3706 6.4222 4.7611 4.3903 6.8869 4.1879 6.5979 4.8491 3.0927 3.4358 3.2716 4.5659 4.7444 3.7504 4.1387 4.3833 2.9585 2.4999 3.4695 2.8226 2.8229 4.1177 3.9781 4.6816 3.5776 4.9247 3.5163 7.2252 2.7641 2.9214 4.8736 6.3167 6.3167 1.8419 1.8378 1.9299 2.0899 3.2257 1.5177 2.2046 1.1741 3.2785 3.6065 2.0758 1.2833 1.2546 1.9717 1.5474 1.4906 1.5707 1.5202 2.9204 2.8135 3.1835 1.3896 1.3900 6.2581 6.2308 1.3409 1.3268 2.2756 2.1198 3.7324 2.1720 2.1594 4.3283 1.5791 1.6519 2.7057 2.5379 1.1648 1.1595 1.0548 1.0543 2.2794 1.1223 1.1222 2.2691 2.2674 2.2948 1.3571 1.3549 1.3015 1.3094 1.3278 1.3507 1.2720 1.2752 1.4904 1.5470 7.5730 7.5663 2.1218 2.1276 1.1091 1.1089 1.1680 1.1636 2.0910 2.1058 1.9508 1.9436 6.0085 6.0063 6.4709 6.2749 6.1430 6.1467 7.5574 11.2112 1.0658 1.0661 1.0807 1.0807 1.0655 1.0659 1.1009 1.1009 1.0980 1.0982 1.0876 1.0876 1.0871 1.0870 1.0904 1.0905 1.0956 1.0957 1.1014 1.1014 1.0751 1.0753
irintensity: 0.0292 0.1333 0.1152 0.0850 0.2038 1.7789 0.1979 1.1635 0.0082 3.8868 0.0061 3.3743 2.8894 7.5290 2.2831 12.1016 1.1960 54.2142 19.8823 6.3948 7.8032 6.4383 1.4087 0.5204 0.7267 0.0105 0.0083 0.3877 13.5819 2.5253 12.1889 8.2498 0.0199 0.9281 10.5557 10.4902 0.3287 0.1481 0.1388 63.5958 48.2263 5.8068 25.3614 55.6591 1.3295 0.2612 176.4763 1.5141 90.0866 0.9481 0.3947 0.0201 1.9554 53.6949 19.4680 3.5633 1.0196 3.5165 2.5008 0.5789 0.0141 0.0178 0.0805 0.0004 0.0325 0.4294 10.8491 5.9429 138.5085 0.1697 4.4641 0.0609 8.5885 14.8548 16.2092 0.0554 0.3470 8.2695 0.7498 0.5946 111.4133 0.2949 0.4589 0.0093 1.9663 0.0845 16.4739 1.2781 5.0581 0.6082 24.3791 1.9549 1.7142 0.7614 123.6903 0.7129 0.5755 0.5616 8.8857 9.2552 25.1096 17.6205 12.0575 11.3961 28.1000 18.1564 1.4169 693.0334 1.3570 1.3657 11.1506 0.1410 12.4854 12.4407 640.3212 1.0624 20.5278 20.8090 42.3994 42.2792 19.0996 12.4661 27.8916 14.4936 20.9374 25.1016 9.1244 8.9750 10.4834 9.5527 8.9051 9.0821 41.9113 41.5314 25.9091 18.1637 14.9343 23.9558
temp: 298.150 k
press: 1.00000 atm
elementType: 8 8 7 7 7 7 6 6 6 6 6 6 6 6 6 6 6 6 6 6 6 6 6 6 6 6 1 1 1 1 1 1 1 1 1 1 1 1 1 1 1 1 1 1 1 1 1 1
symmnumber: 1
zpe: 1007001.3 jmol-1
zpe.correction: 0.383547 hartree
zpe.thermalcorrener: 0.407394 hartree
zpe.thermalcorrenthalpy: 0.408338 hartree
zpe.thermalcorrgfe: 0.324721 hartree
zpe.sumelectzpe: -1142.851438 hartree
zpe.sumelectthermal: -1142.827590 hartree
zpe.sumelectthermalent: -1142.826646 hartree
zpe.sumelectthermalfe: -1142.910263 hartree
dipole: 0.0063 0.0113 0.2229
dipole: 0.2233
quadrupole: -106.2845 -157.3276 -150.7442
quadrupole: -0.7492 0.1012 0.0728
quadrupole: 31.8343 -19.2088 -12.6255 -0.7492 0.1012 0.0728
hfenergy: -1143.2349842 hartree
pointgroup: C01 [X(C20H22N4O2)]
dipole: -0.0043892 -0.0877321 0.0006036 debye
polarizability: 368.5039906|-4.1722407|164.7924057|-72.3079262|5.0039613|282.1849637 unknown
InChI: InChI=1S/C20H22N4O2/c25-19(23-21-15-7-13-17-9-3-1-4-10-17)20(26)24-22-16-8-14-18-11-5-2-6-12-18/h1-6,9-12,15-16,23-24H,7-8,13-14H2
charge 0 multiplicity 1
48 atoms
O  -0.465392 1.185924 -1.775012
O  0.505429 1.296603 1.692347
N  -3.009242 1.242162 -0.396752
N  3.049574 1.22833 0.311199
N  -1.757177 1.261965 0.217776
N  1.796348 1.222122 -0.301358
C  -6.263792 0.003485 0.28232
C  6.277649 -0.108984 -0.275304
C  -6.495955 -0.055637 1.786978
C  6.491295 -0.300062 -1.771573
C  -5.438024 1.252278 -0.173702
C  5.478056 1.18842 0.080558
C  -5.756301 -0.946722 2.606586
C  5.727526 -1.243674 -2.505753
C  -7.442758 0.802686 2.40598
C  7.445609 0.485326 -2.470706
C  -4.048067 1.277943 0.403947
C  4.085979 1.193771 -0.492786
C  -5.953743 -0.980259 4.006577
C  5.908177 -1.398441 -3.899887
C  -7.643773 0.773285 3.803998
C  7.629944 0.334787 -3.8632
C  -6.897738 -0.118497 4.610408
C  6.859583 -0.607936 -4.584168
C  -0.592222 1.23109 -0.517163
C  0.631986 1.255471 0.434354
H  -5.740962 -0.908314 -0.060301
H  -7.234567 0.039294 -0.248609
H  5.743654 -0.978761 0.149359
H  7.255047 -0.045312 0.240751
H  -5.36313 1.2692 -1.275164
H  -5.979972 2.165908 0.144642
H  6.035339 2.062576 -0.313045
H  5.409224 1.295594 1.177325
H  -5.027101 -1.623082 2.143164
H  4.992304 -1.866295 -1.980491
H  -8.0325 1.491182 1.787009
H  8.05452 1.213012 -1.918594
H  -3.956014 1.319801 1.508219
H  3.989529 1.159156 -1.597002
H  -5.375266 -1.677956 4.622702
H  5.31064 -2.135203 -4.448687
H  -8.382977 1.439164 4.263728
H  8.375185 0.946331 -4.384557
H  -7.054029 -0.144007 5.694565
H  7.002831 -0.727571 -5.663797
H  -1.632553 1.299182 1.246705
H  1.670327 1.191365 -1.330383
