program: Gaussian 09
title: 000244641
version: EM64L-G09RevD.01
frameworkgroup: C1[X(C11H12N6O2)]
method: RPBEPBE
basis: SDD
operation: Freq
keyword: #p
keyword: freq=noraman
keyword: PBEPBE/SDD
title: #p freq=noraman PBEPBE/SDD
converged: YES YES NO NO
title: Mulliken charges:
elementType: O O N N N N N N C C C C C C C C C C C H H H H H H H H H H H H
charge: -0.214143 -0.259145 -0.427154 0.018549 -0.132660 -0.116788 -0.639559 -0.591282 0.325872 0.202842 0.497889 -0.562131 -0.340438 -0.370962 0.242990 -0.804962 -0.467319 0.246522 -0.031964 0.289841 0.272248 0.374105 0.236517 0.234232 0.232646 0.231515 0.247530 0.330585 0.314204 0.332576 0.327843
chargesum: 0.00000
title: Mulliken charges with hydrogens summed into heavy atoms:
elementType: O O N N N N N N C C C C C C C C C C C
charge: -0.214143 -0.259145 -0.053050 0.018549 -0.132660 -0.116788 0.005230 0.069137 0.325872 0.202842 0.497889 -0.272289 -0.068190 -0.134445 0.242990 -0.106570 -0.219789 0.246522 -0.031964
polarizability: 3.13319238e+02 5.64375801e-01 2.13150031e+02 -8.38402660e+00 -3.95855766e+00 8.62543306e+01
1716.lowfreq: -5.5255 -0.0003 0.0008 0.0009 1.8690 4.7253 30.4078 39.3350 60.9898
frequency: 30.4001 39.3337 60.9840 72.2969 83.6475 135.1115 164.7298 180.1813 198.0717 204.2149 209.7318 258.6472 264.4447 321.1201 346.0450 370.7409 394.1217 398.1978 429.7080 453.9295 459.2967 503.3965 509.8754 532.6704 534.2682 538.9229 545.5391 602.9988 645.2691 658.3588 668.0869 679.2727 710.9658 728.9235 743.4588 761.8005 796.9372 816.5885 820.8036 844.2756 899.1347 914.2317 919.2559 947.1925 977.8067 1001.5433 1013.3682 1050.8560 1061.9560 1088.9413 1131.3674 1156.1348 1175.0666 1203.4074 1226.6580 1257.2797 1303.4141 1324.0365 1334.0698 1357.1423 1400.7415 1403.7293 1429.2340 1444.1017 1466.6196 1470.7659 1477.1492 1496.9989 1524.0360 1548.4971 1564.5946 1585.5870 1604.2701 1624.9945 1638.9487 2977.7100 3054.0704 3091.6321 3127.6101 3170.7127 3176.9717 3189.2089 3311.6593 3552.9549 3563.1480 3708.4086 3722.8344
redmass: 5.3678 5.9504 3.9633 1.1381 7.1521 4.7124 4.8312 6.7377 5.0897 4.6730 6.0415 4.4928 4.9700 3.0288 4.5938 4.8120 1.1809 7.9222 3.9576 3.7786 1.1967 2.9978 1.1956 3.2016 1.0717 5.9715 6.5122 5.8056 6.8347 6.5943 5.3561 3.8259 5.2819 6.5922 6.3682 3.6506 1.9063 3.3725 1.6971 1.3694 4.5313 1.5700 3.7161 2.2984 1.3379 1.5440 1.9734 1.5294 3.1413 2.2857 2.4862 1.5229 5.5306 1.5242 2.6243 2.0739 2.5744 6.2311 2.7435 3.4199 1.2728 3.4637 4.5368 5.7460 1.6695 1.0508 1.8277 2.6116 3.3035 3.6747 4.5367 2.6938 1.5138 1.7146 5.9167 1.0378 1.0977 1.0984 1.0903 1.0916 1.0940 1.0925 1.0766 1.0449 1.0441 1.1047 1.1059
irintensity: 0.4279 0.9815 1.1318 0.1125 0.2024 0.4202 0.5276 3.1512 10.5417 3.4415 8.1377 3.6648 4.0712 7.7220 0.7883 0.7479 168.0193 1.9308 2.7383 9.3319 248.0433 29.8700 152.6893 18.3571 3.8372 2.4067 13.1193 1.4657 11.0501 6.1103 3.6439 1.7085 0.9422 6.1732 9.9631 1.8203 29.1860 60.9964 128.7114 9.1904 13.3743 12.2501 5.6854 5.1438 1.2194 10.5750 3.3097 12.4216 0.8797 1.6743 1.9201 28.0374 380.7291 98.4202 49.3958 1.2915 103.4604 110.5879 139.1141 16.6159 15.1954 63.7750 4.9930 373.1041 38.9083 14.1439 41.7584 209.7283 671.5223 471.8370 491.5803 113.2541 619.6699 263.4538 16.8312 41.8819 19.4390 12.8705 14.1822 2.7466 3.2619 3.9971 82.2142 99.5134 129.1405 31.0130 46.2435
temp: 298.150 k
press: 1.00000 atm
elementType: 8 8 7 7 7 7 7 7 6 6 6 6 6 6 6 6 6 6 6 1 1 1 1 1 1 1 1 1 1 1 1
symmnumber: 1
zpe: 612412.8 jmol-1
zpe.correction: 0.233256 hartree
zpe.thermalcorrener: 0.250405 hartree
zpe.thermalcorrenthalpy: 0.251349 hartree
zpe.thermalcorrgfe: 0.187679 hartree
zpe.sumelectzpe: -903.930464 hartree
zpe.sumelectthermal: -903.913314 hartree
zpe.sumelectthermalent: -903.912370 hartree
zpe.sumelectthermalfe: -903.976041 hartree
dipole: 1.9704 -6.7711 -0.3790
dipole: 7.0621
quadrupole: -92.7348 -104.7231 -112.5121
quadrupole: 13.5572 4.0825 -8.0104
quadrupole: 10.5885 -1.3998 -9.1888 13.5572 4.0825 -8.0104
hfenergy: -904.1637192 hartree
pointgroup: C01 [X(C11H12N6O2)]
dipole: -0.7121193 -2.6843725 -0.0826802 debye
polarizability: 313.420953|2.3502767|211.6564342|-6.2845191|14.3390198|87.6462127 unknown
InChI: InChI=1S/C11H12N6O2/c1-6-2-3-7(8(4-6)17(18)19)14-10-5-9(12)15-11(13)16-10/h2-5,14H,12-13H2,1H3
charge 0 multiplicity 1
31 atoms
O  3.426077 2.710535 -0.463183
O  1.210845 2.857598 0.039884
N  -0.208906 0.651334 0.221619
N  2.304686 2.154849 -0.13871
N  -2.459201 1.025176 0.568634
N  -4.218289 -0.546717 -0.096472
N  -3.707904 -2.561145 -1.147666
N  -4.719322 1.508402 0.902238
C  1.013406 -0.007778 0.21967
C  2.255252 0.70574 0.044102
C  3.590852 -1.356867 0.224572
C  3.505374 0.029907 0.039283
C  1.127661 -1.418919 0.435012
C  2.368914 -2.063495 0.439401
C  -1.518018 0.146199 0.100754
C  4.922146 -2.083482 0.224897
C  -1.859043 -1.087737 -0.50033
C  -3.253367 -1.390355 -0.575576
C  -3.765598 0.632228 0.440115
H  4.402045 0.637485 -0.111066
H  0.223782 -1.990813 0.654549
H  -0.144451 1.680593 0.316013
H  2.402937 -3.143023 0.631793
H  5.760846 -1.389956 0.046827
H  5.103499 -2.590536 1.191485
H  4.955518 -2.861159 -0.561243
H  -1.11819 -1.742658 -0.960019
H  -4.713312 -2.711403 -1.194611
H  -3.070071 -3.24891 -1.536728
H  -4.422007 2.391204 1.308153
H  -5.701059 1.258904 0.8257
