program: Gaussian 09
title: 000244640
version: EM64L-G09RevD.01
frameworkgroup: C1[X(C11H11N3O2)]
method: RPBEPBE
basis: SDD
operation: Freq
keyword: #p
keyword: freq=noraman
keyword: PBEPBE/SDD
title: #p freq=noraman PBEPBE/SDD
converged: YES YES NO NO
title: Mulliken charges:
elementType: O O N N N C C C C C C C C C C C H H H H H H H H H H H
charge: -0.249380 -0.262158 -0.492003 -0.439214 -0.388507 0.430352 0.444554 0.439923 -0.406545 -0.428593 -0.370654 -0.358168 -0.457318 0.140977 0.195366 -0.802343 0.324444 0.278241 0.241290 0.239663 0.237265 0.373500 0.251639 0.359643 0.240036 0.230325 0.227666
chargesum: 0.00000
title: Mulliken charges with hydrogens summed into heavy atoms:
elementType: O O N N N C C C C C C C C C C C
charge: -0.249380 -0.262158 -0.167559 -0.065714 -0.028864 0.430352 0.444554 0.439923 -0.128304 -0.187303 -0.130991 -0.120903 -0.205679 0.140977 0.195366 -0.104316
polarizability: 2.59029941e+02 -1.56704693e+01 1.40300390e+02 1.04557698e+01 8.56358773e+00 8.16469967e+01
1716.lowfreq: -29.7273 -4.4213 -2.0263 0.0005 0.0007 0.0008 9.7959 33.7958 44.1843
frequency: -29.5276 33.7803 44.1280 71.0289 140.2435 161.1870 178.0760 186.4193 244.2628 268.0795 321.5199 363.5736 378.0234 410.7164 473.6716 495.2347 507.4409 511.5053 526.2184 580.5983 610.7288 621.0647 632.1759 675.8113 686.8280 703.0896 717.6986 748.6545 764.3446 788.2873 819.6318 844.8000 848.4862 943.3462 951.6048 974.7299 982.3524 990.1346 1008.1871 1025.5441 1048.2080 1128.4329 1190.9852 1202.8393 1208.5965 1225.8621 1267.3160 1312.5451 1329.2491 1338.8610 1357.9677 1377.8438 1400.4448 1410.3037 1448.5890 1473.3382 1475.7919 1505.1485 1510.5631 1586.7791 1622.5320 1625.3681 1655.4688 1676.5948 2977.6977 3059.2985 3088.9653 3123.1955 3129.5002 3145.4109 3155.2036 3200.6980 3532.5332 3539.3811 3559.4183
redmass: 1.0194 5.8353 4.8901 4.7264 4.4817 10.2450 5.0459 5.0453 6.9425 4.1553 3.3015 7.3915 3.1691 2.9532 2.1930 3.5777 2.7669 4.4458 4.1915 5.8554 1.5706 3.2833 5.9726 1.7774 3.0499 2.6324 3.6970 2.4053 3.9490 2.1850 1.8303 3.2548 1.2491 4.8352 1.3209 1.3597 2.8791 1.4711 2.7909 3.1750 1.5531 1.2998 1.3645 1.8489 3.1415 2.7976 1.7686 1.5609 2.2785 1.9311 3.2340 2.6714 1.2186 3.2563 1.9504 1.0530 1.2308 2.7211 2.8998 5.8430 4.8381 6.3394 6.2831 5.7451 1.0391 1.0947 1.0999 1.0876 1.0884 1.0968 1.0967 1.0934 1.0776 1.0774 1.0763
irintensity: 0.5605 1.3874 0.1764 2.0556 4.1124 3.4446 4.5543 1.3071 0.4386 4.9948 3.3796 26.8167 3.0053 0.7077 102.3006 38.1871 24.6157 15.7507 1.6149 5.1431 18.3809 4.6544 4.2213 88.9559 17.2401 3.5462 1.7480 51.9761 3.8232 148.9203 37.1446 15.8025 2.6209 2.1770 2.6652 0.2504 7.3771 2.4043 4.4062 19.1240 21.2348 12.4814 0.1934 2.5190 41.4487 3.3578 60.5575 57.8759 42.4296 68.3661 53.7808 125.8960 9.1098 0.7740 27.7006 13.1735 9.7772 186.7522 190.2098 3.7433 171.7338 49.3204 1206.2316 664.4802 36.2345 20.0254 16.0268 12.8122 16.9314 20.1133 2.1055 3.1721 93.7058 67.2844 37.1864
temp: 298.150 k
press: 1.00000 atm
elementType: 8 8 7 7 7 6 6 6 6 6 6 6 6 6 6 6 1 1 1 1 1 1 1 1 1 1 1
symmnumber: 1
zpe: 545043.4 jmol-1
zpe.correction: 0.207596 hartree
zpe.thermalcorrener: 0.220895 hartree
zpe.thermalcorrenthalpy: 0.221839 hartree
zpe.thermalcorrgfe: 0.166673 hartree
zpe.sumelectzpe: -739.382517 hartree
zpe.sumelectthermal: -739.369218 hartree
zpe.sumelectthermalent: -739.368274 hartree
zpe.sumelectthermalfe: -739.423440 hartree
dipole: -7.7391 -2.0842 -0.1204
dipole: 8.0157
quadrupole: -106.0709 -96.4825 -94.3643
quadrupole: 3.3913 -0.6337 6.9087
quadrupole: -7.0984 2.4901 4.6083 3.3913 -0.6337 6.9087
hfenergy: -739.590113 hartree
pointgroup: C01 [X(C11H11N3O2)]
dipole: 3.0653089 0.7365873 -0.0816558 debye
polarizability: 258.3344511|-19.3467943|139.2551735|-7.2501832|-13.5546494|83.3877026 unknown
InChI: InChI=1S/C11H11N3O2/c1-7-2-4-8(5-3-7)12-9-6-10(15)14-11(16)13-9/h2-6,12-14H,1H3
charge 0 multiplicity 1
27 atoms
O  -2.38376 -2.714276 -0.369873
O  -4.804448 1.255764 0.239194
N  0.043255 1.326763 -0.120256
N  -1.226646 -0.689485 -0.220891
N  -3.570883 -0.707818 -0.052936
C  1.339327 0.730672 -0.026622
C  -1.196931 0.698276 -0.060806
C  3.981587 -0.359158 0.158543
C  1.613662 -0.341656 0.863504
C  2.395608 1.264595 -0.808942
C  2.915028 -0.88268 0.932988
C  3.695555 0.730396 -0.705343
C  -2.384462 1.402437 0.101407
C  -2.411596 -1.462846 -0.221472
C  -3.664162 0.72206 0.103295
C  5.387155 -0.920748 0.274087
H  0.010317 2.337454 -0.258598
H  0.830568 -0.726524 1.525227
H  2.192083 2.08433 -1.508154
H  3.106812 -1.715227 1.620211
H  4.498783 1.156704 -1.317955
H  -0.367494 -1.214277 -0.402779
H  -2.387224 2.482594 0.252094
H  -4.454998 -1.224528 -0.045123
H  5.962595 -0.394765 1.060638
H  5.375496 -1.992319 0.538761
H  5.947069 -0.808837 -0.670897
