program: Gaussian 09
title: 000244637
version: EM64L-G09RevD.01
frameworkgroup: C1[X(C10H7Cl2N5O2)]
method: RPBEPBE
basis: SDD
operation: Freq
keyword: #p
keyword: freq=noraman
keyword: PBEPBE/SDD
title: #p freq=noraman PBEPBE/SDD
converged: YES YES NO NO
title: Mulliken charges:
elementType: Cl Cl O O N N N N N C C C C C C C C C C H H H H H H H
charge: 0.002006 0.017178 -0.179517 -0.214671 -0.463328 -0.453144 -0.030765 -0.618608 -0.067267 0.392063 0.467198 -0.106668 -0.402181 -0.428803 0.170884 0.029860 -0.046856 -0.161306 -0.142233 0.364987 0.345307 0.306784 0.267128 0.268446 0.364582 0.318924
chargesum: 0.00000
title: Mulliken charges with hydrogens summed into heavy atoms:
elementType: Cl Cl O O N N N N N C C C C C C C C C C
charge: 0.002006 0.017178 -0.179517 -0.214671 -0.098341 -0.107838 -0.030765 0.064898 -0.067267 0.392063 0.467198 -0.106668 -0.095397 -0.161675 0.170884 0.029860 -0.046856 0.107140 -0.142233
polarizability: 3.22541854e+02 -2.43138009e+01 1.92290190e+02 1.65828732e+01 3.13492718e+00 8.50871251e+01
1716.lowfreq: -6.1048 0.0018 0.0026 0.0028 0.4969 4.7389 25.5629 32.7463 47.2391
frequency: 25.5506 32.7430 47.2368 49.6569 107.2099 149.3632 164.0657 169.5098 184.6570 191.1008 210.0901 235.5773 248.5750 261.4011 313.8099 328.9540 336.8748 379.9109 398.0690 426.8948 441.0161 446.4464 515.7073 538.5769 550.3649 563.3870 595.7581 627.9058 644.6508 648.0950 676.4462 687.1296 692.8785 729.2906 748.2365 763.5387 821.1033 843.2329 882.9136 893.8477 954.4582 960.2366 976.4471 1000.2842 1113.5534 1122.2741 1142.6454 1151.6954 1204.4639 1238.4971 1254.5245 1305.5376 1351.9006 1354.5044 1378.5117 1393.3080 1424.6292 1473.0284 1504.7483 1558.1370 1594.4849 1597.6851 1602.7730 1609.2045 1665.3274 3156.5162 3158.8768 3178.7553 3193.9945 3498.3559 3545.0869 3695.4082
redmass: 8.9522 11.0467 10.0632 8.5942 7.1713 10.3738 8.6531 7.9104 11.7455 8.9467 6.5602 5.9119 5.8701 1.3742 7.1978 7.6694 4.5418 8.6338 10.9388 6.7363 3.5473 6.6864 6.8800 8.7274 1.1665 5.2206 1.2766 6.7864 7.6122 5.3307 5.9642 8.1784 5.1258 4.6855 8.1901 10.7591 1.3939 1.3247 1.5380 3.1495 1.3736 6.1759 2.2142 4.9872 2.7380 2.8140 1.6201 3.0226 6.3665 1.7707 1.4386 1.8564 5.4985 10.0084 4.5894 4.6367 2.3385 3.3586 5.6507 7.5494 8.2003 4.6600 2.4786 1.7342 4.3214 1.0899 1.0921 1.0970 1.0751 1.0777 1.0457 1.1052
irintensity: 5.7069 6.6508 0.9721 3.8590 3.2933 5.3259 0.7066 0.3591 2.2587 2.7501 2.1180 2.6237 6.1789 50.9642 0.5208 5.7654 3.1812 0.7858 0.5188 7.7451 24.6622 17.8290 1.0212 17.6700 281.8138 5.5934 63.2083 23.4861 4.4119 11.7690 2.2225 5.9554 9.2551 1.8352 15.7376 17.6951 22.4862 112.8603 15.1542 25.1427 0.1569 29.8246 3.2624 26.7236 54.2074 76.8880 0.8118 9.6219 186.5730 30.6895 9.0895 123.7014 64.7227 169.7988 79.2677 5.6148 62.5887 162.7465 297.9913 52.1790 571.0726 497.3152 334.1074 187.4742 493.4151 1.5348 3.2028 0.4302 202.1668 40.3961 112.5991 50.9728
temp: 298.150 k
press: 1.00000 atm
elementType: 17 17 8 8 7 7 7 7 7 6 6 6 6 6 6 6 6 6 6 1 1 1 1 1 1 1
symmnumber: 1
zpe: 442209.3 jmol-1
zpe.correction: 0.168429 hartree
zpe.thermalcorrener: 0.185721 hartree
zpe.thermalcorrenthalpy: 0.186665 hartree
zpe.thermalcorrgfe: 0.121343 hartree
zpe.sumelectzpe: -1728.184755 hartree
zpe.sumelectthermal: -1728.167463 hartree
zpe.sumelectthermalent: -1728.166518 hartree
zpe.sumelectthermalfe: -1728.231841 hartree
dipole: -9.1440 3.9794 -3.0263
dipole: 10.4214
quadrupole: -190.7584 -108.5078 -121.7140
quadrupole: 19.5605 -3.6138 1.2370
quadrupole: -50.4317 31.8190 18.6127 19.5605 -3.6138 1.2370
hfenergy: -1728.3531836 hartree
pointgroup: C01 [X(C10H7Cl2N5O2)]
dipole: -3.4541038 -2.0248695 0.8831448 debye
dipolederiv: -0.1757512 -0.1320116 -0.0862662 -0.2937326 -0.4344369 -0.2883999 -0.1931308 -0.2700472 -0.2153571 -0.8751697 -0.1046528 0.0518498 -0.1566669 -0.054874 -0.0093413 0.0800533 -0.0014671 -0.0242156 -1.2025344 -0.1604064 0.0482646 -0.1140803 -0.4611987 0.0259671 0.0262103 0.0181898 -0.343855 -0.7707175 -0.7455051 0.096188 -0.3731496 -0.8026517 0.0808428 0.0099116 0.1050853 -0.1660499 -2.323018 -0.0253373 0.0294627 0.3654255 -0.3053009 -0.013533 0.094348 0.0014788 -0.2933748 -0.8846927 0.3119728 -0.0368308 0.5363531 -1.228004 0.1229017 0.0036688 0.0991704 -0.2250386 -0.8984111 -0.518218 0.1065546 -0.1665092 -1.2405232 0.1391398 0.0417045 0.1103195 -0.3256548 -0.2780651 -0.1563901 0.0275092 -0.0328936 -1.4836097 0.1359948 0.0046501 0.1555377 -0.7357821 0.3086187 0.6418543 -0.0988333 0.5649473 1.2397959 -0.1597248 0.0293107 -0.151301 -0.1362755 2.0692254 0.3956262 -0.0719996 -0.7577869 1.1114216 -0.1584134 -0.241648 -0.1840857 0.2347658 1.7427173 0.1404074 -0.0282032 0.4008671 0.0965227 0.0723912 -0.1061855 0.050333 0.136892 -1.199557 0.0152187 0.039591 -0.3291244 -1.1367713 0.1367913 -0.0175871 0.0972244 -0.0323331 -0.4322856 -0.0306933 -0.0521726 -0.3137338 -0.290538 -0.0601254 -0.2079295 -0.0504145 -0.1322904 -0.4622013 -0.0403193 -0.0215287 0.1619809 -0.0215188 0.0830768 0.0996319 0.1014578 -0.1040551 1.3911134 0.078905 -0.09657 -0.2051653 1.9568778 -0.2305114 -0.0792904 -0.1890947 0.2632154 1.7278009 0.0391895 -0.054045 0.0323617 1.330176 -0.1509532 0.0420957 -0.0911508 0.2929855 0.1530094 0.2084653 0.1486608 0.3955912 0.6750396 0.4971079 0.2854249 0.4710879 0.3102856 -0.0290607 0.0474674 0.0375994 -0.009879 0.0427969 0.0781126 -0.0595732 0.0663097 -0.005315 1.0737246 0.1006648 -0.1407893 0.1397121 -0.1754044 -0.1122589 -0.150522 -0.1124878 -0.1437789 0.3868689 0.0228864 -0.0037435 0.2790384 0.2619892 -0.0205475 0.117518 -0.0076338 0.2594176 0.222963 -0.0090148 0.0223634 -0.0520543 0.1540422 0.0045535 0.0860777 -0.0043862 0.2865049 0.0433228 0.0221447 0.0525884 0.0349824 0.0940059 -0.051108 0.0861088 -0.0584284 0.1006095 0.0631258 -0.0700502 -0.023549 -0.0604604 0.053441 -0.0794829 -0.0173169 -0.0756144 0.1118999 0.0383913 0.0319145 0.0428735 0.0224038 0.0783877 -0.063981 0.0546001 -0.0589462 0.1087606 0.1868617 -0.0866642 0.0178838 -0.0507395 0.2966959 0.0074622 0.0171704 0.0008894 0.3927695 0.1237213 0.0225462 -0.006858 -0.0176878 0.2436391 0.014039 -0.0053014 -0.022026 0.3852692 unknown
polarizability: 317.4223489|37.2677763|195.1682407|-9.024548|17.1174565|87.3285797 unknown
InChI: InChI=1S/C10H7Cl2N5O2/c11-5-2-1-4(3-6(5)12)14-8-7(17-19)9(18)16-10(13)15-8/h1-3,14-15H,13H2
charge 0 multiplicity 1
26 atoms
Cl -3.859412 -2.11392 -1.404513
Cl -5.908958 -0.252173 0.381247
O  4.78879 0.400075 -0.030073
O  3.350735 2.95522 -0.2274
N  0.000089 1.063418 0.17189
N  0.982043 -1.117196 0.347629
N  3.375474 -1.448215 0.221175
N  1.940154 -3.27249 0.527971
N  2.296236 2.231354 -0.080676
C  1.102234 0.247158 0.169748
C  -1.372657 0.717124 0.211952
C  2.398705 0.827468 0.032298
C  -1.885333 -0.388416 -0.520708
C  -2.265119 1.533459 0.956654
C  2.157262 -1.921356 0.358109
C  3.614158 -0.036959 0.068737
C  -3.260336 -0.690239 -0.461705
C  -3.639437 1.235056 0.984168
C  -4.144071 0.113308 0.289435
H  0.318936 2.057203 0.126855
H  0.061748 -1.519585 0.545952
H  -1.246132 -0.963465 -1.19755
H  -1.879837 2.389961 1.518451
H  -4.328462 1.86077 1.558299
H  2.771191 -3.859955 0.553006
H  1.019199 -3.702408 0.56285
