program: Gaussian 09
title: 000244634
version: EM64L-G09RevD.01
frameworkgroup: C1[X(C9H6ClNOS)]
method: RPBEPBE
basis: SDD
operation: Freq
keyword: #p
keyword: freq=noraman
keyword: PBEPBE/SDD
title: #p freq=noraman PBEPBE/SDD
converged: YES YES NO NO
title: Mulliken charges:
elementType: Cl S O N C C C C C C C C C H H H H H H
charge: -0.042807 0.222065 -0.167028 -0.439425 0.379172 0.529606 -0.370705 -0.376876 -0.718562 -0.209808 -0.216470 -0.117109 -0.106540 0.249081 0.235389 0.347688 0.281385 0.260213 0.260728
chargesum: 0.00000
title: Mulliken charges with hydrogens summed into heavy atoms:
elementType: Cl S O N C C C C C C C C C
charge: -0.042807 0.222065 -0.167028 -0.091736 0.379172 0.529606 -0.121624 -0.141487 -0.437177 0.050405 0.044259 -0.117109 -0.106540
polarizability: 2.36735742e+02 -3.54699725e+00 1.27289533e+02 -1.26468674e+00 -1.92905109e+00 5.46196671e+01
1716.lowfreq: -2.8913 0.0034 0.0035 0.0037 4.1174 7.1530 49.3915 54.9209 88.5115
frequency: 49.3862 54.9177 88.5111 157.2576 212.5581 236.1185 253.2796 324.6437 354.6087 408.8354 416.8444 457.6702 494.3334 530.6604 545.9237 598.0639 617.8288 629.5720 660.8770 693.9545 705.6909 734.0260 786.9893 827.2713 836.6732 898.3744 951.3894 965.8945 998.0735 1044.1533 1076.7438 1113.6859 1133.6375 1191.6074 1203.6812 1296.4922 1298.8926 1357.6365 1393.8335 1416.6314 1480.6702 1568.2768 1596.0143 1608.0056 1695.2289 3132.4258 3148.1490 3172.5125 3176.9316 3244.8928 3565.4102
redmass: 5.1327 9.9643 9.2638 8.1795 6.2830 13.3992 8.3927 7.0520 7.8941 2.8975 6.8954 9.8266 3.5533 5.7708 3.2197 4.4236 3.4491 3.0986 3.1966 7.2539 2.1386 1.8071 4.6966 1.2706 1.6260 6.4144 1.3569 1.3734 4.0798 2.4236 2.6562 1.3880 5.1217 1.1340 1.5497 1.6118 1.4834 4.3653 3.7793 2.6420 2.6655 7.0172 6.9281 6.3219 10.4227 1.0897 1.0893 1.0953 1.0967 1.0963 1.0785
irintensity: 0.7297 1.1764 2.8463 0.7283 1.8933 0.2962 0.4698 0.2929 3.2802 0.0157 7.7940 13.7433 20.8873 29.8164 6.2489 14.4098 11.3821 32.1878 51.2536 7.8769 20.7220 66.6414 42.7263 4.5320 55.6290 3.7629 0.1596 0.9286 30.0230 29.2232 43.8114 11.3114 39.7664 0.7387 0.8311 2.5760 0.8575 4.1683 9.7498 52.7215 80.1418 3.6799 15.4577 1.5068 676.8727 10.5107 4.8667 3.7586 1.0448 8.0984 39.1343
temp: 298.150 k
press: 1.00000 atm
elementType: 17 16 8 7 6 6 6 6 6 6 6 6 6 1 1 1 1 1 1
symmnumber: 1
zpe: 337381.2 jmol-1
zpe.correction: 0.128502 hartree
zpe.thermalcorrener: 0.139644 hartree
zpe.thermalcorrenthalpy: 0.140589 hartree
zpe.thermalcorrgfe: 0.089998 hartree
zpe.sumelectzpe: -1333.757904 hartree
zpe.sumelectthermal: -1333.746762 hartree
zpe.sumelectthermalent: -1333.745817 hartree
zpe.sumelectthermalfe: -1333.796408 hartree
dipole: -2.9594 -1.0975 -0.1354
dipole: 3.1592
quadrupole: -118.2854 -80.6316 -91.9523
quadrupole: -6.8348 -1.6528 -1.9402
quadrupole: -21.3290 16.3249 5.0041 -6.8348 -1.6528 -1.9402
hfenergy: -1333.886406 hartree
pointgroup: C01 [X(C9H6Cl1N1O1S1)]
dipole: 1.1852442 0.3562399 -0.11475 debye
dipolederiv: -0.9856878 0.0940946 -0.0245567 0.0907222 -0.1261213 -0.005477 -0.0312788 -0.0026444 -0.0615706 -0.3649985 0.1467546 -0.0530413 -0.4102824 -0.4317322 0.2173619 0.2056795 0.1855354 -0.0222036 -1.0789831 -0.5043713 0.2089973 -0.7443044 -0.8967965 0.2512308 0.3116648 0.2529231 -0.4150771 -0.9945665 -0.2424745 0.113656 0.1660469 -0.4856896 0.0693158 0.0302462 0.0499256 -0.302841 0.5249775 -0.1099402 0.0423436 -0.0821867 -0.0340874 0.0194436 0.1382482 -0.010184 0.0315691 -0.008979 0.1995025 -0.1019584 0.3163274 0.3250561 -0.1415528 -0.236568 -0.0749608 0.115878 -0.1267829 -0.0074516 -0.0202998 -0.0386888 0.0575894 0.0401926 -0.0107285 0.0218013 -0.1332675 -0.0853421 0.0365793 0.0215679 0.0821395 0.0231971 0.0470242 0.0007917 0.0469262 -0.1510545 0.540311 -0.0714436 0.0165829 0.0011169 -0.2185471 -0.0581562 -0.0581351 -0.0632176 -0.2895417 -0.256124 0.0967165 0.0093809 0.1276764 0.003571 0.0166326 0.02567 0.0172125 -0.0867836 -0.3364126 -0.0184794 -0.0182701 -0.1098882 0.0406693 0.0076232 -0.0400875 0.02506 -0.0953728 1.467558 0.5503013 -0.222599 0.8103899 1.3475187 -0.4928613 -0.3493291 -0.4834011 0.3634225 1.3199173 -0.1315757 0.0356512 -0.0896079 0.098357 0.0184681 0.0513002 0.0128718 -0.0712266 0.0473359 0.0885495 0.0094048 0.0611471 -0.0205172 -0.0281801 0.0158097 -0.0172484 0.1433789 0.0049177 -0.1002437 -0.0177745 -0.0995895 -0.0066102 -0.0280721 -0.0287443 -0.0224075 0.1454964 0.2179188 0.0552618 -0.0194518 -0.000423 0.2048447 0.0517779 -0.0385396 0.0394979 0.3150898 0.0243217 -0.0741053 0.0298718 -0.0729029 0.1047393 0.0560104 0.0205564 0.0634062 0.1890536 0.0334139 -0.0634614 -0.0127949 -0.0674568 0.0207544 -0.0217968 -0.0138899 -0.0219784 0.1613799 0.0572046 0.0557866 0.0032902 0.0597644 -0.0061956 -0.0189849 0.0073343 -0.0191179 0.1636708 unknown
polarizability: 236.0682227|-8.8665919|126.4990167|2.9068369|-10.4043397|56.0777028 unknown
InChI: InChI=1S/C9H6ClNOS/c10-7-3-1-6(2-4-7)8-5-13-9(12)11-8/h1-5,11H
charge 0 multiplicity 1
19 atoms
Cl 5.007453 -0.338745 0.081975
S  -3.564053 1.195937 -0.420508
O  -4.207565 -1.344303 0.604485
N  -1.927467 -0.731584 0.349419
C  0.389005 0.149683 -0.029494
C  -1.075984 0.318423 -0.070792
C  1.237049 1.279171 0.138296
C  0.987982 -1.134764 -0.157443
C  -1.777946 1.417186 -0.507795
C  2.638489 1.138744 0.163794
C  2.389722 -1.291277 -0.122422
C  -3.310363 -0.545497 0.273499
C  3.197607 -0.14898 0.03564
H  0.797264 2.272376 0.275955
H  0.368231 -2.022686 -0.328821
H  -1.57469 -1.592291 0.770884
H  -1.366862 2.327339 -0.936665
H  3.284127 2.011206 0.29709
H  2.842899 -2.280939 -0.2282
