program: Gaussian 09
title: 000244633
version: EM64L-G09RevD.01
frameworkgroup: C1[X(C10H6N2O4S)]
method: RPBEPBE
basis: SDD
operation: Freq
keyword: #p
keyword: freq=noraman
keyword: PBEPBE/SDD
title: #p freq=noraman PBEPBE/SDD
converged: YES YES NO NO
title: Mulliken charges:
elementType: S O O O O N N C C C C C C C C C C H H H H H H
charge: 0.173273 -0.198054 -0.133672 -0.195748 -0.189067 -0.372688 0.017124 0.330062 -0.154207 0.211723 -0.281490 -0.330847 0.271077 -0.357101 -0.243891 -0.207619 -0.053367 0.293902 0.262787 0.289897 0.246904 0.249578 0.371422
chargesum: 0.00000
title: Mulliken charges with hydrogens summed into heavy atoms:
elementType: S O O O O N N C C C C C C C C C C
charge: 0.173273 -0.198054 -0.133672 -0.195748 -0.189067 -0.001266 0.017124 0.330062 0.139695 0.211723 -0.281490 -0.068059 0.271077 -0.067204 0.003013 0.041959 -0.053367
polarizability: 2.83580883e+02 8.23642717e+00 1.72204205e+02 3.69647965e+00 -2.72815049e+00 7.09677884e+01
1716.lowfreq: -4.9613 -3.4344 -0.0019 -0.0019 -0.0016 4.0630 18.8793 45.2643 56.4095
frequency: 18.8341 45.2599 56.4063 74.1089 97.3807 137.4914 172.5038 201.6676 211.9735 272.2631 310.9761 349.2938 379.5418 413.4561 433.3230 449.2118 484.3672 522.4947 543.9442 572.5100 589.9525 594.1484 636.5330 647.3181 665.4894 679.1501 692.1916 733.1017 749.4744 778.5301 784.9541 848.8740 881.0512 900.5849 977.9439 991.4389 1004.6667 1043.6049 1060.9846 1130.8612 1142.8190 1177.4489 1198.7799 1213.9060 1258.7516 1288.9274 1310.1207 1349.8252 1364.9021 1385.2566 1435.3013 1470.9406 1568.0463 1604.8829 1612.1733 1646.9416 1703.0283 3129.7623 3145.7742 3159.2274 3172.4232 3188.5393 3542.3270
redmass: 11.0901 13.5029 9.0941 8.0152 10.7359 5.3521 9.0027 8.3579 7.5640 8.5999 6.6850 16.1366 9.2542 3.9310 6.3520 10.0287 8.2851 4.4004 4.4104 10.1988 4.3836 7.3544 5.7790 6.7317 4.7489 2.1134 6.4420 2.7145 3.6272 8.7356 1.4144 4.6297 1.4281 1.5191 1.6636 2.9620 1.3620 3.1945 2.8201 3.8313 2.2021 1.1841 6.1078 2.5022 4.0503 2.0951 1.4616 1.5725 5.8015 5.0495 2.6014 2.5351 6.0268 6.6757 8.3116 8.0932 11.5944 1.0877 1.0869 1.0915 1.0962 1.0977 1.0784
irintensity: 1.0745 1.1813 0.6367 0.1629 1.1453 0.6581 9.6758 0.3955 3.2721 5.8093 2.4743 6.1200 3.6668 1.7051 6.1455 17.4998 24.6073 20.8879 5.4637 14.1722 5.6219 52.2086 14.0511 3.4858 12.6047 49.2550 13.3607 26.7717 74.9184 20.7378 63.1140 6.1789 12.3763 2.5944 3.0956 22.9100 2.6486 0.9417 9.8907 51.1371 16.0730 34.9222 232.5023 140.7246 319.3721 22.9329 26.4077 17.2318 123.6352 5.8423 4.6301 72.6464 19.4186 4.5051 153.1580 179.4167 615.4146 6.1283 1.3614 6.2555 7.8146 6.6576 101.1290
temp: 298.150 k
press: 1.00000 atm
elementType: 16 8 8 8 8 7 7 6 6 6 6 6 6 6 6 6 6 1 1 1 1 1 1
symmnumber: 1
zpe: 390030.3 jmol-1
zpe.correction: 0.148555 hartree
zpe.thermalcorrener: 0.162924 hartree
zpe.thermalcorrenthalpy: 0.163868 hartree
zpe.thermalcorrgfe: 0.104862 hartree
zpe.sumelectzpe: -1191.862812 hartree
zpe.sumelectthermal: -1191.848442 hartree
zpe.sumelectthermalent: -1191.847498 hartree
zpe.sumelectthermalfe: -1191.906504 hartree
dipole: 1.4869 4.6125 1.4862
dipole: 5.0690
quadrupole: -104.9625 -110.3472 -106.9567
quadrupole: 22.2149 -1.7043 3.1729
quadrupole: 2.4596 -2.9251 0.4655 22.2149 -1.7043 3.1729
hfenergy: -1192.0113666 hartree
pointgroup: C01 [X(C10H6N2O4S1)]
dipole: -1.0082062 -1.7189783 0.0764015 debye
dipolederiv: -0.8979474 0.1129982 0.0417965 0.2232796 -0.131096 -0.1202185 0.1883981 -0.1149975 -0.0445176 -0.6064563 -0.0976232 -0.0945877 -0.3428459 -0.7052295 -0.3817369 -0.2684032 -0.3425711 -0.6361837 -1.389588 0.3811546 0.2649735 0.5558216 -0.5967394 -0.2350022 0.4190804 -0.2427229 -0.4770521 -0.8035061 0.274045 0.0695122 0.3711986 -0.6988129 -0.0312042 0.0134307 -0.0124823 -0.2260882 -0.7290081 -0.0497104 0.064784 -0.0103958 -0.625194 0.0043034 0.0066323 0.0028971 -0.1960151 -0.9082398 0.2805867 0.2067382 0.2424737 -0.8653562 -0.4734109 0.1867254 -0.4488444 -0.6943737 1.2170405 -0.1348355 -0.1733809 -0.3955202 1.577153 0.0355546 -0.0540086 0.044179 0.1899862 0.3338089 -0.3033674 -0.0281319 0.1666807 0.0557082 -0.0177773 0.0971067 -0.0199755 0.0159127 0.1815755 0.1501976 0.0941932 -0.0407705 0.0340063 -0.043713 0.1723037 -0.0854846 -0.0595599 0.1422987 -0.0271274 0.052787 0.1870698 -0.5824375 -0.015632 0.0049016 -0.0536994 0.0392479 -0.777383 -0.3051422 -0.2851539 -0.6981911 0.2679625 0.2968188 -0.5966769 0.2819453 0.0621292 -0.2528558 -0.1224648 0.0398222 -0.2762983 -0.0808041 -0.021979 0.0019447 0.0035568 -0.0893991 1.7550424 -0.2191536 -0.1142409 0.3253866 0.8155434 0.5237833 0.2261791 0.4590362 0.7081556 -0.2309926 0.1677923 0.0098203 -0.3506957 0.103915 -0.0222293 -0.0493396 0.0081475 -0.0915948 0.1914246 -0.0182747 0.0206234 0.0510185 0.213825 0.0191275 0.0519418 0.0082528 -0.1022568 -0.0304955 0.1389966 0.0558715 0.3421571 -0.1930805 0.0372915 0.0167203 0.0188704 -0.1256565 2.3111404 -0.2922762 -0.137745 -0.4055668 0.9705432 0.6120344 -0.2668788 0.5943828 0.713342 0.0734232 0.0131824 -0.0028616 0.0003838 0.0619157 -0.0454299 -0.0614526 0.0127763 0.1349669 0.0275215 0.0788006 -0.0343369 0.078747 0.0511595 -0.0007835 -0.0702096 -0.0020635 0.121597 0.0793597 0.0200394 -0.0203867 0.0564927 0.0944881 0.0098118 0.0126858 0.0159677 0.1667144 0.0868716 -0.0094554 -0.0105329 -0.0490607 -0.0682493 -0.012877 -0.0047054 -0.0107781 0.1522031 -0.0508969 -0.0630923 -0.0423366 -0.0521778 0.0625271 -0.0147562 -0.0455018 -0.0170313 0.1517805 0.2778623 0.0247296 0.0227731 0.0208132 0.2382525 -0.1019754 0.0191261 -0.0993614 0.2866621 unknown
polarizability: 281.2960305|-18.5991774|165.3634315|1.8346547|29.1603866|80.0934143 unknown
InChI: InChI=1S/C10H6N2O4S/c13-9-8(17-10(14)11-9)5-6-3-1-2-4-7(6)12(15)16/h1-5,11H
charge 0 multiplicity 1
23 atoms
S  1.809003 -1.631503 -0.792392
O  2.699305 1.372843 1.655324
O  4.556179 -1.986079 -1.066631
O  -3.319203 2.738747 0.188192
O  -1.052773 2.630756 0.006994
N  3.791097 -0.242177 0.337516
N  -2.21695 2.073388 0.093819
C  -1.147242 -0.236697 0.237041
C  0.172396 0.28637 0.618349
C  -2.303316 0.587844 0.056356
C  1.401924 -0.234279 0.318476
C  -1.355185 -1.642923 0.12086
C  2.642706 0.405527 0.857201
C  -3.580746 0.051442 -0.214621
C  -2.621596 -2.188814 -0.163519
C  -3.742436 -1.341826 -0.331281
C  3.652115 -1.320928 -0.537886
H  0.210524 1.198206 1.226984
H  -0.513303 -2.3185 0.300845
H  -4.420327 0.739529 -0.340815
H  -2.736018 -3.274748 -0.241358
H  -4.728739 -1.761033 -0.551804
H  4.726385 0.081355 0.599551
