program: Gaussian 09
title: 000244626
version: EM64L-G09RevD.01
frameworkgroup: C1[X(C9H13Cl3O2)]
method: RPBEPBE
basis: SDD
operation: Freq
keyword: #p
keyword: freq=noraman
keyword: PBEPBE/SDD
title: #p freq=noraman PBEPBE/SDD
converged: NO YES NO NO
title: Mulliken charges:
elementType: Cl Cl Cl O O C C C C C C C C C H H H H H H H H H H H H H
charge: 0.143359 0.109989 0.106175 -0.248147 -0.192754 -0.070172 0.016909 -0.424993 -0.443658 -0.398365 -0.400637 -0.743089 0.514866 -0.763026 0.219300 0.238721 0.208370 0.195004 0.233720 0.213968 0.195523 0.206052 0.202615 0.213403 0.245653 0.216074 0.205141
chargesum: 0.00000
title: Mulliken charges with hydrogens summed into heavy atoms:
elementType: Cl Cl Cl O O C C C C C C C C C
charge: 0.143359 0.109989 0.106175 -0.248147 -0.192754 0.149127 0.255629 -0.021619 0.004030 0.003210 0.015381 -0.076221 0.514866 -0.763026
polarizability: 1.48749883e+02 2.80044161e+00 1.26557500e+02 7.49419938e+00 1.46101868e+00 1.13367221e+02
1716.lowfreq: -10.2077 -0.7225 -0.0025 -0.0019 0.0009 9.6318 17.6300 41.0370 53.3337
frequency: 17.1649 40.8258 53.2845 66.8196 110.2058 155.6243 160.5543 172.9295 206.3436 212.7037 250.4391 268.3420 280.4895 312.3731 327.0501 358.5737 375.5838 391.3240 423.4681 437.1165 503.7206 542.7915 610.0537 698.5685 752.3964 758.5677 785.0640 816.6656 829.0433 863.5627 879.9097 907.0479 934.4563 960.1703 977.6424 993.0328 1056.2610 1074.9894 1097.2572 1110.8255 1154.8465 1162.8409 1169.1323 1221.2418 1246.9733 1247.9490 1289.2817 1298.9470 1307.9259 1327.9263 1336.1281 1338.8005 1348.0592 1365.3041 1390.5258 1462.2118 1464.5726 1469.0917 1473.8620 1477.0986 1485.0297 1637.7854 2963.7681 2974.5194 2975.4426 2977.8917 2978.4088 2993.2529 3007.7807 3033.4478 3039.7812 3047.9480 3063.5254 3068.5440 3090.0714
redmass: 5.7044 6.1857 8.0428 4.7834 4.0446 5.4685 4.2740 4.7661 1.6515 2.0495 9.1845 10.8740 6.6101 1.7191 9.1973 2.6201 3.2814 16.4939 3.9659 3.3753 3.3290 2.0339 13.2875 7.3188 7.4768 12.1456 2.1694 2.2223 1.9055 2.0638 2.4499 1.7765 5.0139 2.9759 1.3045 1.6308 1.3825 1.8202 1.6669 2.6643 2.2686 2.0620 5.9726 1.4558 1.2752 1.3815 1.3147 1.2097 1.2734 1.3749 1.4423 1.4153 1.5047 1.6085 1.2179 1.0839 1.0872 1.0797 1.0707 1.0788 1.0535 12.3289 1.0662 1.0640 1.0530 1.0605 1.0650 1.0633 1.0831 1.0973 1.0980 1.1011 1.1033 1.0984 1.0993
irintensity: 0.0836 0.0151 1.3909 0.1956 0.1563 2.0339 0.3856 1.9029 0.4933 2.4114 0.3901 1.0447 0.8625 0.0689 0.5124 1.0475 7.5761 1.7191 0.6345 5.5440 3.5203 1.7752 122.4748 32.9324 112.7596 58.5344 12.9725 13.0712 24.5329 0.5553 21.5908 5.5080 57.2685 156.7067 9.5238 5.7959 2.2785 2.8086 1.7101 1.0828 1.8601 22.0229 325.1305 4.7616 1.5518 0.6941 0.2745 1.7456 1.7047 1.3373 3.4935 0.0588 1.6711 2.4801 13.9145 7.3472 10.0190 6.7738 15.4341 9.3973 13.6550 161.5858 16.4940 29.0436 9.9802 33.9308 34.3943 6.6328 29.9772 40.5341 49.8508 46.3008 19.5580 68.8762 22.7276
temp: 298.150 k
press: 1.00000 atm
elementType: 17 17 17 8 8 6 6 6 6 6 6 6 6 6 1 1 1 1 1 1 1 1 1 1 1 1 1
symmnumber: 1
zpe: 542286.1 jmol-1
zpe.correction: 0.206546 hartree
zpe.thermalcorrener: 0.221955 hartree
zpe.thermalcorrenthalpy: 0.222900 hartree
zpe.thermalcorrgfe: 0.161703 hartree
zpe.sumelectzpe: -1880.273629 hartree
zpe.sumelectthermal: -1880.258220 hartree
zpe.sumelectthermalent: -1880.257275 hartree
zpe.sumelectthermalfe: -1880.318473 hartree
dipole: 3.8923 0.3711 0.7597
dipole: 3.9831
quadrupole: -99.3067 -103.9978 -107.2116
quadrupole: -0.8455 -0.4947 -2.9868
quadrupole: 4.1987 -0.4924 -3.7062 -0.8455 -0.4947 -2.9868
hfenergy: -1880.4801751 hartree
pointgroup: C01 [X(C9H13Cl3O2)]
dipole: 1.5375872 -0.0509479 0.2982149 debye
polarizability: 149.0829915|-0.2582294|126.1266224|7.6444282|1.1747943|113.46499 unknown
InChI: InChI=1S/C9H13Cl3O2/c1-6-4-2-3-5-7(6)14-8(13)9(10,11)12/h6-7H,2-5H2,1H3
charge 0 multiplicity 1
27 atoms
Cl -4.253685 -0.133261 -0.871477
Cl -2.951477 -0.29732 1.848782
Cl -2.77082 2.264882 0.213186
O  -0.414468 0.279868 0.246783
O  -1.428958 -0.737897 -1.594728
C  1.938175 0.937803 0.335669
C  0.969294 -0.109141 -0.241569
C  3.388114 0.525942 -0.04578
C  1.267653 -1.545389 0.220024
C  3.732206 -0.912487 0.4067
C  2.717596 -1.930616 -0.164328
C  1.603661 2.364898 -0.14702
C  -1.477176 -0.101493 -0.524568
C  -2.79987 0.398635 0.126373
H  1.847127 0.900517 1.441323
H  0.946319 -0.057474 -1.34874
H  4.092975 1.252036 0.402583
H  3.50942 0.606585 -1.146698
H  0.545027 -2.245268 -0.23744
H  1.144091 -1.599414 1.31912
H  3.717127 -0.96314 1.514682
H  4.758169 -1.176327 0.086699
H  2.810419 -1.964507 -1.269089
H  2.936955 -2.949522 0.205665
H  0.583558 2.660187 0.153141
H  2.314163 3.095515 0.280867
H  1.672607 2.435691 -1.24996
