program: Gaussian 09
title: 000244621
version: EM64L-G09RevD.01
frameworkgroup: C1[X(C14H19ClO2)]
method: RPBEPBE
basis: SDD
operation: Freq
keyword: #p
keyword: freq=noraman
keyword: PBEPBE/SDD
title: #p freq=noraman PBEPBE/SDD
converged: YES YES NO NO
title: Mulliken charges:
elementType: Cl O O C C C C C C C C C C C C C C H H H H H H H H H H H H H H H H H H H
charge: -0.068291 -0.224111 -0.259826 0.355139 -0.425438 -0.401005 -0.410263 -0.747342 -0.388054 -0.104449 0.541199 -0.690975 -0.332804 -0.349507 -0.237655 -0.236215 -0.221894 0.191767 0.199715 0.192122 0.237886 0.238278 0.193586 0.257183 0.206292 0.209922 0.216902 0.209631 0.214114 0.211153 0.209942 0.219370 0.272356 0.255337 0.231912 0.234023
chargesum: 0.00000
title: Mulliken charges with hydrogens summed into heavy atoms:
elementType: Cl O O C C C C C C C C C C C C C C
charge: -0.068291 -0.224111 -0.259826 0.355139 -0.033956 0.029004 0.021601 -0.073946 0.038479 0.109665 0.541199 -0.050509 -0.332804 -0.077152 0.017682 -0.004303 0.012128
polarizability: 2.15093721e+02 -9.71533255e+00 1.67752470e+02 3.26441168e+00 -4.00250149e-02 1.06534265e+02
1716.lowfreq: -10.0257 -0.0014 -0.0012 -0.0011 5.2762 6.2804 21.4480 33.0667 58.4826
frequency: 21.3251 33.0232 58.4516 61.1462 88.1414 125.8975 140.3547 170.8956 181.7831 199.4277 221.9230 233.2522 252.7863 285.8106 302.2985 320.6183 338.7338 397.6271 403.6618 410.3230 418.3456 451.4929 477.9405 538.5812 554.1946 619.2965 648.2690 695.8590 722.9948 736.2857 762.3696 766.2928 849.6253 854.5367 862.5629 875.8497 886.8799 923.4085 927.7112 934.5445 947.9946 959.0439 961.5486 989.5977 993.1470 1013.4553 1027.1119 1042.7117 1054.0355 1072.7794 1097.3001 1123.0261 1170.7955 1172.4288 1180.3295 1192.8085 1209.9091 1226.2160 1248.7252 1275.9237 1284.5389 1297.4490 1314.3086 1327.2976 1337.5857 1352.8995 1354.6152 1357.0110 1384.7135 1387.9467 1390.7167 1425.7962 1447.6949 1451.7964 1461.5075 1469.3337 1470.2936 1475.7026 1477.9120 1482.9868 1486.5207 1578.5558 1612.9038 2912.7806 2925.1593 2934.3788 2944.2906 2972.7237 2979.0204 2981.1439 2993.3239 3034.6286 3068.6144 3071.0914 3073.9956 3074.6085 3085.1025 3094.4385 3137.1962 3154.5114 3170.9046 3178.5677
redmass: 4.0119 4.6393 2.2286 2.6856 3.3556 4.4691 3.4664 2.7316 1.4951 2.8020 4.0907 1.1517 5.6007 3.6595 2.9975 2.5397 3.3533 2.7810 2.7946 3.8698 3.3615 3.5216 5.3523 4.3958 4.9490 5.9490 4.6038 5.4693 4.5153 1.1200 1.2368 3.7483 1.4594 2.2036 2.7328 1.9784 2.1826 4.1676 1.6677 2.2366 5.2780 1.5790 1.5106 1.9154 1.3460 5.8975 3.9103 2.0972 2.5486 1.7785 2.1138 1.6437 1.1149 1.9642 1.8190 1.5992 1.7090 1.3059 1.5082 1.5120 1.2304 1.5022 1.1827 1.4879 1.2154 1.8950 1.3738 1.5495 1.4866 2.2621 1.2286 2.1741 1.0806 1.0827 1.0813 1.3122 1.8121 1.0600 1.0462 1.0568 1.0792 6.3848 7.3525 1.0827 1.0681 1.0662 1.0605 1.0356 1.0547 1.0449 1.0964 1.1012 1.0984 1.1006 1.0977 1.0983 1.0947 1.0985 1.0861 1.0915 1.0949 1.0991
irintensity: 0.5451 0.3039 0.4639 0.2988 1.4917 2.4177 0.0951 2.8393 0.6584 0.5028 2.0551 0.0310 1.9690 0.3574 0.2938 0.6867 0.1731 5.0956 0.4504 1.6753 7.9326 4.1341 9.0596 1.2815 5.5425 2.1942 9.1842 18.3694 1.5777 7.2337 108.5077 4.4034 7.4949 3.4817 28.4104 4.0466 25.3798 13.0886 12.4091 17.7176 29.3285 16.4416 2.2673 3.8845 0.1058 94.0133 146.7454 19.8406 2.2286 60.6900 15.0032 6.3893 4.9898 1.1517 9.8757 1.0744 8.3969 0.9843 1.6688 19.2424 1.3102 1.2063 5.8465 6.7528 0.5585 34.8347 7.1968 1.7368 26.2027 18.5368 19.1324 25.5983 6.4368 1.3662 3.6509 9.1378 10.4199 12.1212 15.7249 6.3148 16.8226 13.1651 9.1839 26.0662 29.2381 51.0328 77.3084 48.2208 20.7387 30.4940 18.5191 18.7204 10.2324 62.5461 38.7862 64.0483 31.3771 24.1725 3.0877 14.4251 6.5766 12.6302
temp: 298.150 k
press: 1.00000 atm
elementType: 17 8 8 6 6 6 6 6 6 6 6 6 6 6 6 6 6 1 1 1 1 1 1 1 1 1 1 1 1 1 1 1 1 1 1 1
symmnumber: 1
zpe: 784331.4 jmol-1
zpe.correction: 0.298736 hartree
zpe.thermalcorrener: 0.316012 hartree
zpe.thermalcorrenthalpy: 0.316956 hartree
zpe.thermalcorrgfe: 0.252386 hartree
zpe.sumelectzpe: -1154.075204 hartree
zpe.sumelectthermal: -1154.057928 hartree
zpe.sumelectthermalent: -1154.056984 hartree
zpe.sumelectthermalfe: -1154.121554 hartree
dipole: -1.9866 -0.6349 -0.5328
dipole: 2.1525
quadrupole: -92.4115 -107.4990 -113.8796
quadrupole: -6.1557 -0.1896 -1.0381
quadrupole: 12.1852 -2.9023 -9.2829 -6.1557 -0.1896 -1.0381
hfenergy: -1154.3739401 hartree
pointgroup: C01 [X(C14H19Cl1O2)]
dipole: 0.7654663 0.3086023 -0.1897867 debye
polarizability: 215.9962001|-6.7071576|166.4732877|-4.294902|4.5446439|106.910968 unknown
InChI: InChI=1S/C14H19ClO2/c1-3-8-14(2)9-16-13(17-10-14)11-6-4-5-7-12(11)15/h4-7,13H,3,8-10H2,1-2H3
charge 0 multiplicity 1
36 atoms
Cl -2.5602 -2.685084 -0.353883
O  0.006645 -0.600457 1.077443
O  0.245466 0.804033 -0.867001
C  2.316521 0.094284 0.374598
C  3.737256 -0.504777 0.156151
C  1.424501 -1.015543 1.002518
C  1.677611 0.45543 -0.995769
C  2.339755 1.32817 1.308041
C  4.792624 0.446198 -0.458233
C  -0.488782 -0.310358 -0.275801
C  -1.948623 0.062685 -0.1728
C  6.161116 -0.248425 -0.631718
C  -2.974221 -0.907824 -0.17859
C  -2.328888 1.421283 -0.039063
C  -4.335091 -0.568769 -0.055441
C  -3.685095 1.787874 0.085547
C  -4.689536 0.792493 0.079008
H  3.654595 -1.404959 -0.491102
H  4.116291 -0.863942 1.136731
H  1.500856 -1.952248 0.404681
H  1.717517 -1.226017 2.04462
H  2.142014 1.347713 -1.444283
H  1.780065 -0.402322 -1.699393
H  1.310623 1.634218 1.560459
H  2.872419 1.095543 2.249561
H  2.845283 2.187931 0.832765
H  4.914094 1.337367 0.186622
H  4.445478 0.814087 -1.444218
H  -0.33002 -1.219674 -0.902652
H  6.552077 -0.601969 0.341084
H  6.079624 -1.127288 -1.298924
H  6.909735 0.43816 -1.06737
H  -1.535893 2.174232 -0.050676
H  -5.098723 -1.351618 -0.064754
H  -3.958559 2.843299 0.1867
H  -5.745538 1.066776 0.175345
