program: Gaussian 09
title: 000244620
version: EM64L-G09RevD.01
frameworkgroup: C1[X(C13H17ClO2)]
method: RPBEPBE
basis: SDD
operation: Freq
keyword: #p
keyword: freq=noraman
keyword: PBEPBE/SDD
title: #p freq=noraman PBEPBE/SDD
converged: YES YES NO NO
title: Mulliken charges:
elementType: Cl O O C C C C C C C C C C C C C H H H H H H H H H H H H H H H H H
charge: -0.067481 -0.227528 -0.256732 0.341368 -0.401177 -0.394556 -0.410347 -0.734006 -0.099823 -0.722264 0.536138 -0.327798 -0.352944 -0.236924 -0.235414 -0.221957 0.191757 0.240990 0.233573 0.191807 0.204268 0.198692 0.211974 0.202923 0.256188 0.212804 0.227202 0.224395 0.220643 0.272966 0.255289 0.231937 0.234035
chargesum: 0.00000
title: Mulliken charges with hydrogens summed into heavy atoms:
elementType: Cl O O C C C C C C C C C C C C C
charge: -0.067481 -0.227528 -0.256732 0.341368 0.031570 0.030823 -0.007387 -0.062921 0.112981 -0.050024 0.536138 -0.327798 -0.079978 0.018365 -0.003477 0.012077
polarizability: 1.95693450e+02 9.91320951e+00 1.59299118e+02 8.26864451e+00 3.03281502e+00 9.93521944e+01
1716.lowfreq: -1.7137 0.0012 0.0015 0.0016 5.6819 9.5572 24.5496 51.8186 70.9033
frequency: 24.2898 51.5696 70.8462 88.1822 129.8206 158.1557 175.1688 196.1303 201.9956 222.7543 250.3826 271.7036 300.6544 328.0984 344.0852 382.4313 399.1109 416.1951 437.2409 449.7048 476.0477 525.1070 545.5128 603.9594 632.4291 690.7471 723.2011 761.7324 764.3095 777.2588 853.8814 863.6427 878.9043 887.1114 922.0548 926.6601 944.0826 956.7955 960.5025 966.2797 993.2140 1007.6311 1018.9779 1031.8633 1044.2883 1063.7849 1067.8129 1123.3942 1170.2520 1171.0634 1184.9497 1199.8422 1210.5833 1239.1103 1264.9257 1277.1904 1315.5555 1327.1731 1336.0999 1344.7724 1354.2495 1363.1137 1385.7348 1390.4999 1401.0613 1426.0458 1448.6992 1453.7318 1467.5687 1469.8103 1471.5637 1481.3475 1487.4867 1493.8311 1578.8464 1612.7252 2907.2596 2926.2880 2935.5734 2956.6644 2980.8542 2986.1724 3007.2457 3069.3971 3074.3393 3076.6521 3082.9970 3086.6812 3096.6563 3137.2688 3154.7702 3171.5852 3179.0472
redmass: 4.5324 4.3891 4.0950 2.0568 4.5850 2.9333 1.7421 1.7714 3.9688 2.8942 2.7250 2.0112 3.7600 2.3654 3.6458 2.6236 2.4358 3.9373 3.6041 3.6047 5.3638 4.1849 3.8927 5.8133 5.2627 6.0143 4.5547 1.2761 2.9316 1.2808 2.2872 3.0323 2.1866 2.1652 2.1349 2.9480 5.4498 1.6119 1.5418 1.9554 1.3423 2.7351 3.5803 2.4550 2.0814 1.8552 2.3778 1.6408 1.8717 1.1722 1.7197 1.4848 1.7095 1.4025 1.5703 1.4580 1.1545 1.5945 1.3096 1.3854 2.1234 1.2791 2.7473 1.3925 1.2025 2.1822 1.0817 1.0802 1.1072 2.1680 1.1410 1.0523 1.0594 1.0487 6.4071 7.3450 1.0825 1.0679 1.0680 1.0594 1.0376 1.0363 1.1004 1.0976 1.0976 1.0975 1.0994 1.0957 1.0983 1.0862 1.0916 1.0948 1.0989
irintensity: 0.5906 0.8871 1.4467 0.4913 1.4655 1.2011 1.6983 1.2552 2.2590 0.6966 0.9876 0.8849 0.3747 0.2505 0.3067 0.1184 3.4544 8.7162 4.1064 2.1991 9.5485 2.8812 1.4701 4.7720 7.2800 19.8068 1.9251 106.5294 7.7264 4.1116 4.2680 41.6579 4.2686 19.7535 9.1271 5.3369 35.0208 12.2117 5.3861 16.6202 0.0440 127.4031 36.0450 52.1637 19.4921 49.2532 52.3797 5.6563 2.3277 1.7632 10.1244 2.4034 7.9649 0.8590 10.9118 11.2744 1.1658 15.4428 0.7564 2.3553 33.0699 5.2469 19.6393 25.5353 20.9473 25.8620 6.8202 2.2105 6.4140 16.0731 3.6033 18.5562 17.7900 7.2418 12.8765 9.0711 29.4887 21.0760 93.1484 60.4112 21.2010 32.0994 24.7080 3.6408 21.6781 74.7943 48.7765 27.1248 20.6040 3.1810 14.7352 6.2949 12.2353
temp: 298.150 k
press: 1.00000 atm
elementType: 17 8 8 6 6 6 6 6 6 6 6 6 6 6 6 6 1 1 1 1 1 1 1 1 1 1 1 1 1 1 1 1 1
symmnumber: 1
zpe: 712178.8 jmol-1
zpe.correction: 0.271255 hartree
zpe.thermalcorrener: 0.286961 hartree
zpe.thermalcorrenthalpy: 0.287905 hartree
zpe.thermalcorrgfe: 0.227709 hartree
zpe.sumelectzpe: -1114.851742 hartree
zpe.sumelectthermal: -1114.836035 hartree
zpe.sumelectthermalent: -1114.835091 hartree
zpe.sumelectthermalfe: -1114.895287 hartree
dipole: 1.8291 -0.6608 0.6958
dipole: 2.0655
quadrupole: -84.4698 -101.3389 -106.8291
quadrupole: 5.3200 3.3628 1.7991
quadrupole: 13.0762 -3.7930 -9.2832 5.3200 3.3628 1.7991
hfenergy: -1115.1229963 hartree
pointgroup: C01 [X(C13H17Cl1O2)]
dipole: 0.7078672 0.3012595 -0.2618439 debye
polarizability: 196.9243343|-7.8091431|158.2764877|-6.997477|2.7035731|99.1439408 unknown
InChI: InChI=1S/C13H17ClO2/c1-3-13(2)8-15-12(16-9-13)10-6-4-5-7-11(10)14/h4-7,12H,3,8-9H2,1-2H3
charge 0 multiplicity 1
33 atoms
Cl -2.060167 -2.708411 -0.223492
O  0.512833 -0.50754 0.886001
O  0.513047 0.906397 -1.064969
C  2.719027 0.266266 -0.023925
C  1.933629 -0.871803 0.685369
C  1.936462 0.604956 -1.326097
C  4.131766 -0.238014 -0.444268
C  2.793652 1.518348 0.881486
C  -0.117891 -0.238007 -0.412444
C  5.060544 -0.668595 0.713752
C  -1.576589 0.070137 -0.17066
C  -2.545628 -0.949678 -0.046859
C  -2.011485 1.411465 -0.031666
C  -3.902217 -0.674851 0.209745
C  -3.365163 1.713995 0.224598
C  -4.311567 0.670643 0.347633
H  1.991872 -1.808731 0.085279
H  2.317041 -1.067138 1.699153
H  2.338844 1.510538 -1.809952
H  1.99866 -0.248209 -2.039651
H  4.628588 0.567509 -1.02381
H  4.012896 -1.094173 -1.141776
H  3.282423 1.290505 1.845762
H  3.368269 2.325334 0.388337
H  1.779303 1.894342 1.096646
H  0.018258 -1.138442 -1.057923
H  5.257196 0.163424 1.412915
H  4.632251 -1.506337 1.293437
H  6.035368 -1.006383 0.317404
H  -1.26442 2.202236 -0.14317
H  -4.620558 -1.494625 0.299364
H  -3.681493 2.757182 0.327555
H  -5.36485 0.895061 0.547322
