program: Gaussian 09
title: 000244617
version: EM64L-G09RevD.01
frameworkgroup: C1[X(C9H17ClO3)]
method: RPBEPBE
basis: SDD
operation: Freq
keyword: #p
keyword: freq=noraman
keyword: PBEPBE/SDD
title: #p freq=noraman PBEPBE/SDD
converged: YES YES NO NO
title: Mulliken charges:
elementType: Cl O O O C C C C C C C C C H H H H H H H H H H H H H H H H H
charge: -0.038937 -0.296010 -0.278488 -0.231911 0.352375 -0.515555 0.066747 -0.725640 -0.738076 -0.732945 -0.535341 0.364249 -0.686757 0.217212 0.242923 0.264981 0.196231 0.234147 0.233528 0.233762 0.215174 0.216143 0.253206 0.223405 0.231762 0.225284 0.204260 0.235636 0.286608 0.282025
chargesum: 0.00000
title: Mulliken charges with hydrogens summed into heavy atoms:
elementType: Cl O O O C C C C C C C C C
charge: -0.038937 -0.296010 -0.278488 -0.231911 0.352375 -0.055420 0.331728 -0.061733 -0.072997 -0.024573 0.129839 0.364249 -0.118123
polarizability: 1.28865346e+02 -4.71870714e+00 1.22145013e+02 4.72280880e+00 1.70826646e+00 9.59978393e+01
1716.lowfreq: -13.7755 -8.5466 -0.0008 0.0011 0.0017 2.9461 18.9573 31.1583 53.0959
frequency: 18.3878 31.0147 52.9252 55.7522 77.5502 115.6766 139.9464 159.2129 181.8991 192.8269 211.7669 234.1977 244.6528 261.0774 281.3656 300.1067 337.7066 367.0204 403.9784 433.1771 449.5295 478.1447 518.9116 558.7557 651.7987 698.8953 738.3173 771.0020 833.5565 864.9585 882.6581 920.4594 921.7718 925.4220 965.5835 987.8394 1013.5246 1030.0212 1073.3113 1105.2329 1116.7145 1144.0823 1147.8720 1174.5465 1189.7320 1220.1029 1238.7947 1261.8114 1268.8179 1298.2638 1347.7259 1358.9023 1368.0125 1386.8091 1390.6410 1431.2988 1434.0037 1443.9825 1457.7677 1462.8687 1465.6990 1472.0517 1478.8204 1480.9502 1484.5938 1491.7448 1629.9894 2950.3132 2982.8661 2989.9723 2991.1871 2997.8822 3033.0411 3033.5637 3054.2187 3077.3296 3082.9138 3085.7791 3087.4167 3091.8818 3097.4418 3100.3913 3101.9931 3180.2419
redmass: 4.4164 5.2677 4.2929 5.1143 5.2068 2.0255 2.8193 1.1028 5.5943 2.9678 1.1126 2.0517 1.1092 1.5693 3.2287 2.9003 2.3774 2.7740 2.1046 2.9508 3.1493 2.8560 3.4952 5.8736 5.3927 4.1000 6.2400 3.8001 2.5519 1.7454 2.7374 1.4559 4.3180 1.8569 1.5915 1.4966 4.9566 1.7407 1.6316 1.3918 1.2619 1.8484 1.5353 2.2863 1.9377 2.0481 2.4582 1.2342 1.8348 1.5472 1.5897 1.2789 1.2244 1.2276 1.2275 1.1050 1.1203 1.0616 1.0632 1.0547 1.0546 1.0654 1.0525 1.0471 1.0542 1.0543 10.4402 1.0329 1.0355 1.0360 1.0382 1.0580 1.0957 1.0922 1.1011 1.0986 1.0566 1.0987 1.1000 1.0994 1.0992 1.0985 1.1005 1.1118
irintensity: 0.9369 0.6998 1.0933 0.9448 0.5737 6.2933 3.8989 0.7934 2.7006 7.7256 1.7827 0.5283 0.5407 1.4934 5.1524 4.5987 1.8417 1.2740 0.6809 16.2492 3.4318 2.3958 0.4110 15.5306 25.3942 9.4332 2.9539 6.3932 6.3233 1.5397 6.2929 0.2613 47.6860 21.9224 0.4999 3.5220 72.0166 20.8078 2.6527 127.6605 0.3984 33.1144 12.0421 79.2985 6.6328 64.2055 158.5760 16.0799 19.9166 8.9641 9.4901 15.3904 20.2978 24.8471 23.3290 16.3801 6.1482 2.5819 15.3756 3.1584 4.3650 8.8931 3.7509 7.3521 10.2752 22.8888 186.2421 48.4255 18.9345 12.0266 18.9897 20.0109 38.0414 21.1430 12.4471 32.3614 7.7653 23.7951 18.7190 38.6231 39.6268 23.8826 16.8985 2.3864
temp: 298.150 k
press: 1.00000 atm
elementType: 17 8 8 8 6 6 6 6 6 6 6 6 6 1 1 1 1 1 1 1 1 1 1 1 1 1 1 1 1 1
symmnumber: 1
zpe: 652413.2 jmol-1
zpe.correction: 0.248491 hartree
zpe.thermalcorrener: 0.265015 hartree
zpe.thermalcorrenthalpy: 0.265959 hartree
zpe.thermalcorrgfe: 0.202639 hartree
zpe.sumelectzpe: -1037.808529 hartree
zpe.sumelectthermal: -1037.792005 hartree
zpe.sumelectthermalent: -1037.791061 hartree
zpe.sumelectthermalfe: -1037.854381 hartree
dipole: -1.3003 0.8532 -3.1059
dipole: 3.4736
quadrupole: -81.5786 -84.8048 -92.0755
quadrupole: 1.5373 -0.7612 -3.1279
quadrupole: 4.5744 1.3482 -5.9226 1.5373 -0.7612 -3.1279
hfenergy: -1038.0570201 hartree
pointgroup: C01 [X(C9H17Cl1O3)]
dipole: 0.6414983 -0.5508528 -1.0736226 debye
polarizability: 126.2418136|-5.4814893|125.1613739|2.0981|-3.5117468|95.6050106 unknown
InChI: InChI=1S/C9H17ClO3/c1-7(13-8(11)6-10)5-9(2,3)12-4/h7H,5-6H2,1-4H3
charge 0 multiplicity 1
30 atoms
Cl -2.539993 2.743804 -1.218373
O  1.756681 0.909242 1.143801
O  -1.042904 -0.170094 -1.119749
O  -2.627289 -0.429036 0.584429
C  2.370279 -0.086783 0.220367
C  1.35365 -0.509344 -0.884119
C  -0.012538 -0.964317 -0.333082
C  2.714516 -1.255763 1.163761
C  3.653869 0.477171 -0.431333
C  -0.316334 -2.457406 -0.500584
C  1.323408 2.180204 0.552908
C  -2.269618 0.048813 -0.516797
C  -3.129805 0.955553 -1.381067
H  1.811871 -1.311453 -1.493403
H  1.181154 0.343649 -1.565918
H  -0.129252 -0.649733 0.720655
H  3.151243 -2.100439 0.600822
H  1.814854 -1.607253 1.697588
H  3.442221 -0.920358 1.922309
H  4.340475 0.847507 0.350258
H  4.17394 -0.312651 -1.003524
H  3.434827 1.305687 -1.128851
H  -1.298935 -2.713279 -0.070127
H  -0.302147 -2.740739 -1.56847
H  0.454236 -3.052077 0.02247
H  0.528457 2.045575 -0.207648
H  2.16731 2.742896 0.105791
H  0.91346 2.760932 1.394557
H  -4.168219 0.946389 -1.028372
H  -3.043019 0.709601 -2.4480
