program: Gaussian 09
title: 000244597
version: EM64L-G09RevD.01
frameworkgroup: C1[X(C12H21Br2NO3)]
method: RPBEPBE
basis: SDD
operation: Freq
keyword: #p
keyword: freq=noraman
keyword: PBEPBE/SDD
title: #p freq=noraman PBEPBE/SDD
converged: YES YES NO NO
title: Mulliken charges:
elementType: Br Br O O O N C C C C C C C C C C C C H H H H H H H H H H H H H H H H H H H H H
charge: 0.044723 0.062539 -0.279960 -0.383070 -0.230199 -0.115001 -0.427739 -0.436356 -0.013486 -0.003417 0.340060 -0.714046 -0.684130 -0.708696 -0.713758 -0.604954 -0.549090 0.278783 0.228260 0.259017 0.238572 0.244579 0.195414 0.195244 0.228638 0.201216 0.220695 0.205381 0.237986 0.226460 0.231650 0.201595 0.220094 0.216363 0.200167 0.265296 0.363945 0.369789 0.387438
chargesum: 0.00000
title: Mulliken charges with hydrogens summed into heavy atoms:
elementType: Br Br O O O N C C C C C C C C C C C C
charge: 0.044723 0.062539 -0.279960 0.004368 -0.230199 -0.115001 0.059538 0.046795 0.181928 0.191827 0.340060 -0.063497 -0.014304 -0.055357 -0.031933 -0.241009 -0.179301 0.278783
polarizability: 2.07867841e+02 4.96166482e+00 1.71560131e+02 1.42879406e+00 4.31182577e+00 1.63978108e+02
1716.lowfreq: -4.7997 -0.0006 -0.0006 -0.0006 4.3464 12.5354 29.2203 37.9292 40.4090
frequency: 29.1741 37.8208 40.2206 44.7765 61.9514 75.2117 90.0148 103.8248 107.4531 119.0218 142.9909 152.4951 165.9092 192.2486 203.9356 225.0467 235.7558 240.7072 269.3558 291.7468 294.2737 310.8848 326.5668 337.6739 367.9572 377.7090 393.3503 437.8723 470.5148 486.9829 523.0385 544.2431 578.9462 620.9117 646.1813 662.3079 706.5251 737.6768 757.6442 774.9907 821.9123 873.9765 878.8869 892.7988 917.0821 918.9905 947.6536 957.1808 964.0235 965.9853 989.4383 1045.1027 1063.7792 1100.4091 1106.3581 1119.3725 1128.0996 1134.1275 1163.4279 1177.7568 1192.7930 1204.4668 1211.4758 1248.1758 1274.8279 1296.2159 1303.9932 1310.4394 1322.2246 1337.3930 1353.4298 1356.2171 1368.6187 1377.8547 1381.2315 1397.6767 1402.3146 1410.2346 1447.2058 1458.5295 1473.1042 1476.2485 1479.6237 1482.4539 1487.0350 1492.4813 1496.8782 1502.6752 1558.0238 1640.4514 2952.5043 2953.0069 2967.1796 2969.1177 2973.7478 2980.7110 3013.9070 3024.7999 3057.7450 3061.2421 3065.5848 3067.0838 3071.0475 3073.8669 3075.2855 3081.3496 3090.7765 3095.4906 3129.0953 3146.8535 3523.7390
redmass: 5.1732 3.1953 4.0924 5.9039 5.0808 6.9811 7.0005 4.9686 6.9891 5.2628 8.1501 7.3970 3.6998 5.2141 4.4056 9.6233 1.1329 3.8129 3.7482 1.0851 1.0506 2.6285 1.8236 1.6287 2.0364 2.1851 2.3370 1.6723 5.1479 2.9866 3.7745 3.1581 2.9321 2.5790 3.2018 3.1003 5.7754 5.8115 3.9172 3.3544 3.7135 2.0397 1.7653 2.9749 1.3236 1.2125 1.6750 1.7951 1.6715 1.7145 2.4289 2.8037 1.8083 1.9796 1.9859 1.8284 1.1341 1.3321 1.9300 2.2449 1.9760 2.4785 1.3731 1.4373 1.2793 1.5026 1.4646 1.4668 1.6469 1.4756 1.9266 1.2481 1.2688 1.2265 1.2248 1.2196 1.2201 2.4719 1.1235 1.0510 1.0458 1.0492 1.0940 1.0547 1.0606 1.0520 1.0578 1.0573 4.9414 8.9577 1.0813 1.0824 1.0362 1.0376 1.0370 1.0363 1.0610 1.0599 1.0983 1.0995 1.1000 1.0987 1.1011 1.0998 1.1004 1.0996 1.1036 1.0998 1.0864 1.0866 1.0642
irintensity: 0.1832 0.0359 0.1036 0.6062 3.3027 1.3782 2.0306 0.7817 0.3447 0.1887 2.6480 2.3236 3.1756 0.4789 2.1546 0.4512 0.2718 0.9528 5.2830 0.2625 0.7869 2.6399 2.1746 0.9980 0.2009 1.6329 12.7982 2.7568 18.7970 21.1443 34.4290 47.8102 75.8856 116.5210 54.5225 7.8734 3.8458 3.1422 3.5146 6.4549 9.9698 11.0443 13.2163 1.5451 1.8218 0.1522 1.8086 4.5336 2.0941 2.9527 6.6986 216.8599 46.2343 43.3941 32.5720 3.9890 17.2436 27.7901 5.8304 8.6745 0.5012 6.3845 6.5021 25.3881 5.3389 10.4088 0.7381 17.7663 9.8749 3.4985 77.4781 3.5528 20.0402 19.4053 15.5739 15.4635 13.4269 34.0169 25.5419 12.8815 0.3819 16.2587 11.1715 8.7279 9.9838 17.2985 18.9747 27.4068 301.3686 243.4383 28.8476 29.7115 28.4273 36.1413 13.0534 23.6159 25.8694 28.8650 24.9668 47.1515 5.6180 45.1197 90.3239 34.3697 22.7106 40.9301 6.2602 20.6641 1.1026 3.8391 50.6085
temp: 298.150 k
press: 1.00000 atm
elementType: 35 35 8 8 8 7 6 6 6 6 6 6 6 6 6 6 6 6 1 1 1 1 1 1 1 1 1 1 1 1 1 1 1 1 1 1 1 1 1
symmnumber: 1
zpe: 834220.0 jmol-1
zpe.correction: 0.317738 hartree
zpe.thermalcorrener: 0.339703 hartree
zpe.thermalcorrenthalpy: 0.340647 hartree
zpe.thermalcorrgfe: 0.264703 hartree
zpe.sumelectzpe: -775.786469 hartree
zpe.sumelectthermal: -775.764504 hartree
zpe.sumelectthermalent: -775.763560 hartree
zpe.sumelectthermalfe: -775.839504 hartree
dipole: 3.5136 1.5636 -1.0290
dipole: 3.9811
quadrupole: -120.4047 -129.7602 -125.9903
quadrupole: -0.7702 -5.0373 1.3673
quadrupole: 4.9804 -4.3751 -0.6052 -0.7702 -5.0373 1.3673
hfenergy: -776.1042069 hartree
pointgroup: C01 [X(C12H21Br2N1O3)]
dipole: -1.2303545 -0.9649581 0.0909825 debye
polarizability: 204.0374895|9.7987548|168.8892192|-7.097081|-7.4293589|170.4793715 unknown
InChI: InChI=1S/C12H21Br2NO3/c1-7(2)5-15(6-8(3)4)11(16)9(13)10(14)12(17)18/h7-10,17H,5-6H2,1-4H3
charge 0 multiplicity 1
39 atoms
Br 0.558225 1.527039 -2.416029
Br 3.960473 0.871287 -1.413079
O  0.12973 1.276429 1.267928
O  3.463895 1.258525 1.970126
O  2.540722 -0.8076 1.431321
N  -1.173924 -0.237109 0.051824
C  -2.311743 0.00027 0.990862
C  -1.345536 -1.256306 -1.020667
C  -3.317977 1.111076 0.560881
C  -0.967946 -2.731127 -0.666268
C  -0.030693 0.506558 0.257744
C  -4.093754 0.771523 -0.734874
C  -2.668347 2.510438 0.455632
C  -1.732115 -3.282344 0.56057
C  0.551255 -2.969682 -0.506839
C  1.115824 0.445524 -0.771748
C  2.371253 1.081171 -0.156869
C  2.768644 0.388375 1.142852
H  -2.856038 -0.952277 1.103482
H  -1.875081 0.273861 1.967266
H  -0.780178 -0.939741 -1.915481
H  -2.411986 -1.237418 -1.304723
H  -4.053754 1.13899 1.394673
H  -1.304969 -3.307288 -1.55616
H  -3.427452 0.801316 -1.617272
H  -4.5687 -0.227389 -0.685327
H  -4.894048 1.515148 -0.904989
H  -3.443141 3.277808 0.270331
H  -2.119996 2.772997 1.37612
H  -1.949088 2.550228 -0.382889
H  -1.419932 -2.767612 1.487547
H  -2.828024 -3.175086 0.450332
H  -1.513227 -4.358107 0.689938
H  0.744751 -4.038895 -0.301988
H  1.104003 -2.712772 -1.431437
H  0.981547 -2.391756 0.33102
H  1.323692 -0.557679 -1.163632
H  2.263985 2.161255 0.000829
H  3.720248 0.788375 2.809098
