program: Gaussian 09
title: 000244594
version: EM64L-G09RevD.01
frameworkgroup: C1[X(C12H21NO3)]
method: RPBEPBE
basis: SDD
operation: Freq
keyword: #p
keyword: freq=noraman
keyword: PBEPBE/SDD
title: #p freq=noraman PBEPBE/SDD
converged: YES YES NO NO
title: Mulliken charges:
elementType: O O O N C C C C C C C C C C C C H H H H H H H H H H H H H H H H H H H H H
charge: -0.290564 -0.418509 -0.253229 -0.129665 -0.458128 -0.426000 -0.006489 -0.010445 -0.687737 -0.706136 -0.687103 -0.711470 0.207359 -0.171421 -0.288533 0.162210 0.240311 0.217442 0.221873 0.260919 0.198520 0.195815 0.218884 0.216758 0.227027 0.230067 0.203509 0.218970 0.204652 0.244396 0.208710 0.217725 0.202083 0.220288 0.252579 0.296014 0.379317
chargesum: 0.00000
title: Mulliken charges with hydrogens summed into heavy atoms:
elementType: O O O N C C C C C C C C C C C C
charge: -0.290564 -0.039191 -0.253229 -0.129665 -0.000375 0.056792 0.192031 0.185370 -0.025068 -0.053590 -0.029345 -0.071374 0.207359 0.081159 0.007480 0.162210
polarizability: 2.08900972e+02 9.60556128e+00 1.40385133e+02 2.32296863e+00 1.30732845e+01 1.20120122e+02
1716.lowfreq: -12.3361 -7.5588 0.0002 0.0003 0.0005 8.0432 24.7380 36.3170 38.5537
frequency: 24.1301 36.0875 38.4845 47.8537 69.4243 89.8098 113.1128 136.0983 152.7755 175.9255 205.0196 232.6942 236.2118 242.3078 252.3892 272.6089 282.9811 294.1243 323.9734 342.1071 368.6707 378.4414 403.3027 456.3629 484.9533 522.6687 564.3778 579.8248 620.7660 642.6744 668.3674 728.6189 748.6382 773.3595 818.1881 876.1585 881.0219 910.3050 915.6660 918.6481 936.6259 948.6732 954.9579 961.6726 966.7585 999.2457 1002.3250 1058.7298 1064.6558 1101.1433 1116.2581 1137.2578 1176.2963 1188.8477 1200.5127 1203.2309 1228.1329 1267.7468 1290.2279 1300.4913 1308.5697 1320.3247 1324.9307 1337.3355 1354.1472 1369.3218 1376.0132 1377.4622 1396.9972 1399.1259 1406.1636 1444.1719 1461.0786 1466.7365 1475.4293 1476.1641 1480.0615 1481.7206 1488.9408 1491.3787 1496.7181 1545.5933 1629.1682 1653.4519 2953.8582 2956.2440 2966.7077 2973.0732 2977.6948 2981.2378 3016.1360 3020.0718 3060.6443 3064.1267 3066.0767 3070.6017 3070.6708 3073.0602 3075.0587 3078.6600 3083.8714 3098.8292 3160.2258 3174.1340 3520.9365
redmass: 3.1210 3.7061 5.8587 3.7204 5.6220 3.2453 4.8066 3.2378 4.5726 3.2155 2.5908 2.9834 3.4294 1.0664 1.2078 1.1189 2.2014 1.5877 3.0144 3.1535 2.0753 2.1726 2.1711 1.7107 3.1913 3.9738 1.7238 5.1903 2.2765 2.7819 2.7887 7.6556 4.1855 3.3157 3.6409 1.5176 1.8370 2.0411 1.3215 1.2456 3.1312 1.7913 1.8671 1.5730 1.7965 2.4454 1.0935 2.0076 1.8071 1.5989 1.8337 2.0630 2.2402 1.8820 1.8651 1.8103 1.5411 1.2735 1.4339 1.4626 1.4665 1.6304 2.3221 1.4565 1.2840 1.2539 1.2321 1.2247 1.2453 1.2306 2.0022 1.1399 1.0537 1.0454 1.0516 1.0540 1.0572 1.0695 1.0631 1.0552 1.0809 5.5077 8.5309 6.4588 1.0823 1.0822 1.0361 1.0356 1.0363 1.0367 1.0598 1.0603 1.0995 1.0999 1.1001 1.1003 1.0993 1.1001 1.1001 1.0996 1.1038 1.0991 1.0912 1.0916 1.0640
irintensity: 0.0146 0.7694 0.9435 0.3615 2.5908 0.1463 2.1442 4.2802 0.3130 0.3594 0.8490 0.2868 1.4118 0.0198 0.1391 0.4338 1.0489 1.6873 2.1513 0.7636 0.5238 2.2257 9.2237 4.1490 5.7589 55.1229 71.5078 31.6378 39.0649 22.4783 22.7268 32.8538 2.1120 7.0008 0.8815 6.2367 30.8959 0.1406 0.5915 1.0415 1.1626 9.7025 1.8438 1.6535 0.6898 40.8537 50.3289 320.0496 63.1906 2.3025 4.5161 40.9678 8.5776 0.8881 16.0929 4.4954 42.6247 0.2350 20.4311 4.3668 35.7067 3.2752 170.1727 7.4498 7.8790 8.7350 18.6560 9.6944 16.1733 24.2669 108.1361 20.0066 12.4375 1.0792 3.3915 17.2704 15.0550 20.4899 11.3211 39.9232 2.6535 179.5727 193.8345 30.0628 28.4405 29.2911 28.4035 34.7423 12.4292 25.9627 44.3540 27.7571 41.8821 3.7595 9.2067 75.7525 75.1382 14.9737 59.6144 64.3251 4.7061 21.3265 4.7596 0.7119 50.5322
temp: 298.150 k
press: 1.00000 atm
elementType: 8 8 8 7 6 6 6 6 6 6 6 6 6 6 6 6 1 1 1 1 1 1 1 1 1 1 1 1 1 1 1 1 1 1 1 1 1
symmnumber: 1
zpe: 825039.6 jmol-1
zpe.correction: 0.314241 hartree
zpe.thermalcorrener: 0.333102 hartree
zpe.thermalcorrenthalpy: 0.334046 hartree
zpe.thermalcorrgfe: 0.265950 hartree
zpe.sumelectzpe: -749.021315 hartree
zpe.sumelectthermal: -749.002454 hartree
zpe.sumelectthermalent: -749.001510 hartree
zpe.sumelectthermalfe: -749.069606 hartree
dipole: 2.3712 2.1651 1.5322
dipole: 3.5578
quadrupole: -86.7956 -98.4442 -105.4497
quadrupole: 2.6386 2.2747 -4.4806
quadrupole: 10.1009 -1.5477 -8.5532 2.6386 2.2747 -4.4806
hfenergy: -749.3355557 hartree
pointgroup: C01 [X(C12H21N1O3)]
dipole: 0.9890233 0.624244 0.7690403 debye
polarizability: 209.0814639|-2.1663276|135.4644155|10.6597154|14.5116341|124.8603474 unknown
InChI: InChI=1S/C12H21NO3/c1-9(2)7-13(8-10(3)4)11(14)5-6-12(15)16/h5-6,9-10,15H,7-8H2,1-4H3
charge 0 multiplicity 1
37 atoms
O  -0.100599 -1.043662 -1.782444
O  -4.935363 -0.241958 -0.7449
O  -3.965462 0.703137 1.148261
N  1.115649 -0.041115 -0.054503
C  1.242099 0.905147 1.085896
C  2.367365 -0.596456 -0.642038
C  1.321146 2.424051 0.723863
C  2.842508 -1.953824 -0.037312
C  0.020084 2.982674 0.104442
C  2.536406 2.763296 -0.171537
C  1.801603 -3.083671 -0.210284
C  3.289874 -1.843374 1.440455
C  -0.083495 -0.376776 -0.692377
C  -1.36742 0.022518 -0.032109
C  -2.563009 -0.242614 -0.627127
C  -3.831056 0.129365 0.037549
H  2.167207 0.635259 1.62407
H  0.412391 0.74895 1.798397
H  3.168047 0.152119 -0.512752
H  2.183211 -0.736243 -1.72167
H  1.472337 2.928778 1.703375
H  3.738648 -2.218598 -0.640386
H  0.124592 4.067474 -0.081949
H  -0.852187 2.841071 0.768266
H  -0.20348 2.501135 -0.865276
H  2.430696 2.308981 -1.173812
H  3.486785 2.411429 0.272747
H  2.615161 3.857167 -0.309532
H  2.224452 -4.05011 0.122212
H  1.476765 -3.177061 -1.260088
H  0.899928 -2.883947 0.398033
H  2.428409 -1.638893 2.10369
H  4.042642 -1.044705 1.586831
H  3.74139 -2.795331 1.775779
H  -1.373938 0.507316 0.949131
H  -2.605695 -0.732159 -1.604627
H  -5.771491 0.021731 -0.273173
