program: Gaussian 09
title: 000020361
version: EM64L-G09RevD.01
frameworkgroup: C1[X(C5H7Cl3O2)]
method: RPBEPBE
basis: SDD
operation: Freq
keyword: #p
keyword: freq=noraman
keyword: PBEPBE/SDD
title: #p freq=noraman PBEPBE/SDD
converged: YES YES NO NO
title: Mulliken charges:
elementType: Cl Cl Cl O O C C C C C H H H H H H H
charge: 0.111877 0.114427 0.086049 -0.258443 -0.232699 -0.006655 0.129847 -0.335876 -0.687148 -0.583898 0.230867 0.277823 0.225187 0.238543 0.211541 0.234530 0.244028
chargesum: 0.00000
title: Mulliken charges with hydrogens summed into heavy atoms:
elementType: Cl Cl Cl O O C C C C C
charge: 0.111877 0.114427 0.086049 -0.258443 -0.232699 0.224212 0.407670 0.127854 0.002952 -0.583898
polarizability: 1.01226421e+02 -1.76643261e+00 8.63558180e+01 -9.01448967e+00 -2.25369345e+00 7.57278314e+01
1716.lowfreq: -12.9194 -12.1844 -0.0029 -0.0023 -0.0022 3.7859 45.7482 63.0288 133.5403
frequency: 45.6545 62.9291 133.5151 167.4880 185.1559 199.2943 226.5180 237.2128 267.6506 293.0720 360.6663 370.4388 443.2639 558.8622 592.4830 685.0038 715.3482 754.6763 795.7521 882.5765 889.9528 929.6078 958.3959 978.6397 1051.2275 1071.4512 1127.1491 1150.7796 1192.0778 1245.6611 1300.7013 1305.8735 1332.5374 1362.0624 1395.9800 1459.5830 1472.8790 1479.4254 2995.3731 3000.5335 3020.3953 3021.9852 3092.2460 3107.0119 3113.4023
redmass: 4.7503 5.9372 4.5735 15.8628 2.2500 1.5444 8.2646 12.7299 15.0125 3.6786 11.8373 6.8047 2.5020 7.1173 3.6872 11.4915 10.6804 8.4775 4.0830 4.7018 2.1048 2.5646 2.0799 7.3987 2.3495 5.2765 1.6262 2.1517 1.3423 1.1758 1.2047 1.2440 1.1621 1.5176 1.2450 1.0535 1.0732 1.0612 1.0397 1.0828 1.0664 1.0820 1.0985 1.1025 1.1039
irintensity: 1.6091 0.9971 1.1663 0.7887 2.7972 1.7120 2.5082 0.2271 1.7002 0.7869 2.1822 2.4015 3.3510 81.2414 5.2604 41.6629 173.9047 70.6454 73.7845 36.3057 8.4675 37.4809 20.2284 27.4759 4.0556 171.2381 3.3687 25.3302 3.2469 3.0444 5.8288 1.2105 13.4156 2.9384 25.6415 7.8962 14.7891 6.2032 12.2656 40.5390 52.0479 3.9988 17.9136 10.6931 32.9864
temp: 298.150 k
press: 1.00000 atm
elementType: 17 17 17 8 8 6 6 6 6 6 1 1 1 1 1 1 1
symmnumber: 1
zpe: 305242.1 jmol-1
zpe.correction: 0.116261 hartree
zpe.thermalcorrener: 0.127240 hartree
zpe.thermalcorrenthalpy: 0.128184 hartree
zpe.thermalcorrgfe: 0.078299 hartree
zpe.sumelectzpe: -1724.525331 hartree
zpe.sumelectthermal: -1724.514351 hartree
zpe.sumelectthermalent: -1724.513407 hartree
zpe.sumelectthermalfe: -1724.563292 hartree
dipole: -3.7364 -0.5310 -0.1036
dipole: 3.7753
quadrupole: -70.1231 -83.6386 -78.3692
quadrupole: 2.0647 -1.7736 0.1884
quadrupole: 7.2538 -6.2616 -0.9922 2.0647 -1.7736 0.1884
hfenergy: -1724.6415913 hartree
pointgroup: C01 [X(C5H7Cl3O2)]
dipole: -1.4589639 -0.2744816 -0.0477627 debye
dipolederiv: -0.560703 0.3439095 0.0377763 0.3426488 -0.4443418 -0.0306966 0.0196871 -0.0393689 -0.1424128 -0.2605156 -0.2362257 0.0874785 -0.244582 -0.683674 0.2054506 0.0688794 0.2021739 -0.2167891 -0.2707059 0.0082572 0.208203 0.0005017 -0.1433565 -0.0417006 0.1782627 -0.0484076 -0.7110334 -1.229099 0.1147487 -0.0136975 0.0780668 -0.4345191 0.0376391 0.0769555 0.0516702 -0.3569731 -0.8424578 -0.1649278 0.0761841 -0.1761635 -0.5784848 0.0525956 0.0897485 0.0914978 -0.3901805 0.7944739 -0.0203389 0.0179121 0.2161607 0.2128428 0.0542685 -0.1117195 0.0821664 0.3230254 1.1605431 0.1338464 0.1691551 0.090214 0.4919682 -0.0253473 0.1931002 -0.0237022 0.3479112 0.455136 0.1501328 -0.0893558 -0.0596214 0.129282 0.063363 -0.114544 -0.0414445 0.3089601 -0.0438828 0.0521861 0.0385231 0.0806362 -0.0011995 -0.0693612 0.0646147 -0.0543224 -0.0266568 0.8873455 -0.1823958 -0.4118814 -0.1873108 1.271938 -0.1678451 -0.4537921 -0.1709719 1.0087127 -0.0961855 -0.0180915 -0.0588998 -0.0726911 0.0175641 -0.0485364 -0.0911957 -0.0464997 -0.12177 -0.0701921 -0.017284 0.0173266 0.0051043 0.0455303 -0.024266 0.0827701 -0.0098503 -0.0611781 0.0235527 0.0094307 -0.0121769 0.045605 0.0802281 -0.0590254 0.0465915 0.0111418 -0.1335879 -0.014244 -0.1106397 0.0027796 -0.1034366 -0.019624 -0.0101843 -0.0217207 -0.0507216 0.0882349 -0.0896111 -0.0736845 0.0524202 -0.111263 0.0348385 0.0214815 0.0616939 0.0007305 0.0914009 0.0622084 -0.0257919 -0.1129259 0.004932 0.0828067 -0.0203028 -0.0688581 -0.0453104 -0.0531777 0.0943374 0.0368684 -0.0088212 0.0911988 -0.0617991 0.0624673 -0.0204736 0.0912187 0.0455141 unknown
polarizability: 101.4554775|-1.12503|86.2016497|-8.7521169|-2.7114848|75.6529428 unknown
InChI: InChI=1S/C5H7Cl3O2/c1-3-2-9-4(10-3)5(6,7)8/h3-4H,2H2,1H3
charge 0 multiplicity 1
17 atoms
Cl 2.80097 -1.017995 0.017907
Cl 2.072973 1.8770 -0.464729
Cl 0.878774 0.388572 1.899175
O  -0.8121 0.749223 -0.756453
O  -0.267825 -1.523265 -0.438749
C  -2.084322 0.022183 -0.414293
C  0.264143 -0.220975 -0.811075
C  -1.573237 -1.281342 0.233824
C  -2.928552 0.918295 0.486349
C  1.429224 0.233885 0.130028
H  -2.600698 -0.193378 -1.370061
H  0.689222 -0.308219 -1.829865
H  -1.423938 -1.167515 1.322542
H  -2.200119 -2.159177 0.015269
H  -3.876022 0.413009 0.749409
H  -2.380962 1.159529 1.413293
H  -3.173929 1.86177 -0.029169
