program: Gaussian 09
title: 000244578
version: EM64L-G09RevD.01
frameworkgroup: C1[X(C13H6N2O5)]
method: RPBEPBE
basis: SDD
operation: Freq
keyword: #p
keyword: freq=noraman
keyword: PBEPBE/SDD
title: #p freq=noraman PBEPBE/SDD
converged: YES YES NO YES
title: Mulliken charges:
elementType: O O O O O N N C C C C C C C C C C C C C H H H H H H
charge: -0.134684 -0.172268 -0.200382 -0.184643 -0.186780 0.013695 0.018618 0.194072 0.325006 0.217575 0.213692 -0.299066 0.304183 -0.598038 -0.347893 0.457946 -0.530508 -0.407728 -0.229244 -0.216625 0.339834 0.310693 0.332787 0.288855 0.243550 0.247354
chargesum: 0.00000
title: Mulliken charges with hydrogens summed into heavy atoms:
elementType: O O O O O N N C C C C C C C C C C C C C
charge: -0.134684 -0.172268 -0.200382 -0.184643 -0.186780 0.013695 0.018618 0.194072 0.325006 0.217575 0.213692 -0.299066 0.304183 -0.258205 -0.037200 0.457946 -0.197721 -0.118873 0.014306 0.030729
polarizability: 3.13614183e+02 9.62447567e-01 2.10465666e+02 2.53691813e+00 -1.73873514e+00 6.46089674e+01
1716.lowfreq: 0.0003 0.0006 0.0007 4.2964 7.1355 7.6096 42.1219 42.9609 53.5267
frequency: 42.1182 42.9608 53.5253 88.4629 132.4314 137.8943 172.9796 181.7519 196.6114 237.7316 279.5560 307.3554 317.1800 331.4256 383.2425 414.0395 454.4712 477.7413 511.2333 519.2953 548.8949 553.5908 619.6958 648.2127 657.6602 678.0319 702.3141 718.7534 723.8728 738.8474 762.2557 788.5161 812.5316 838.0785 882.1784 915.4331 964.5176 967.6010 975.9919 986.7414 992.6653 1010.2269 1035.3106 1071.3903 1090.5812 1155.8338 1173.2257 1183.7108 1199.8775 1207.1707 1217.3328 1237.6182 1289.4172 1355.1750 1375.4589 1390.8458 1396.5919 1430.9693 1443.2273 1455.5030 1477.6130 1575.8041 1584.8773 1602.9999 1618.8367 1641.0803 3143.3785 3155.7721 3171.7670 3178.0539 3187.2117 3208.9101
redmass: 8.7243 14.0672 14.5958 6.5575 6.4122 11.2413 6.5568 10.6718 5.2921 7.2227 11.6036 9.4225 6.3539 12.1621 7.5318 3.9738 4.5981 5.6722 7.8403 7.5863 4.4778 5.8071 7.0189 7.9943 8.0254 6.5421 4.9838 7.7380 8.6415 8.4604 1.6250 3.4855 8.7674 3.1997 10.9874 1.4394 7.4522 1.4875 1.4907 1.4982 6.8988 1.3777 2.0460 1.8681 1.9507 2.7182 1.9025 1.3831 4.0444 4.3352 6.4940 3.2037 1.5814 4.2275 10.2172 11.2825 6.6947 2.7151 3.7285 2.6128 7.2911 8.7948 7.1092 7.5865 8.2920 11.7503 1.0870 1.0923 1.0992 1.0937 1.0919 1.0942
irintensity: 1.2715 0.3958 0.0384 3.1921 5.8381 1.3940 2.7941 3.3632 0.8292 0.9376 2.6451 1.1038 0.7112 0.6263 0.4354 0.8188 6.0389 1.8991 0.8052 3.8135 2.5817 6.5283 4.7094 10.8781 8.6972 14.9545 6.3737 13.2660 8.4816 10.7391 85.0883 8.6937 1.0575 1.1596 16.3713 0.2245 16.9567 19.6447 10.9993 13.7410 3.6877 0.1163 0.4133 53.0371 26.8182 5.6765 14.6150 10.6762 264.8235 115.4904 355.1260 20.4704 8.1157 40.0800 49.8195 26.5765 87.3274 51.5404 1.9380 5.8994 27.0116 95.8071 1.7993 29.2178 92.2274 157.4652 1.7604 4.7608 21.1154 11.6238 22.6503 6.6240
temp: 298.150 k
press: 1.00000 atm
elementType: 8 8 8 8 8 7 7 6 6 6 6 6 6 6 6 6 6 6 6 6 1 1 1 1 1 1
symmnumber: 1
zpe: 442762.8 jmol-1
zpe.correction: 0.168639 hartree
zpe.thermalcorrener: 0.183832 hartree
zpe.thermalcorrenthalpy: 0.184776 hartree
zpe.thermalcorrgfe: 0.124945 hartree
zpe.sumelectzpe: -983.080939 hartree
zpe.sumelectthermal: -983.065746 hartree
zpe.sumelectthermalent: -983.064802 hartree
zpe.sumelectthermalfe: -983.124633 hartree
dipole: 6.2524 0.1515 -0.1542
dipole: 6.2561
quadrupole: -112.5805 -133.8399 -112.5845
quadrupole: -1.5487 -2.2434 0.1171
quadrupole: 7.0878 -14.1716 7.0838 -1.5487 -2.2434 0.1171
hfenergy: -983.2495786 hartree
pointgroup: C01 [X(C13H6N2O5)]
dipole: 2.4608174 0.0243375 -0.0453927 debye
dipolederiv: -0.4586387 -0.0130341 0.0053873 -0.0231631 -0.9772772 0.0136147 0.0010503 0.0034135 -0.2832939 -0.5099688 0.1768972 -0.1614325 0.273991 -0.7514902 0.112371 -0.159066 0.0917856 -0.2803995 -0.5310575 -0.1187738 -0.2161452 -0.1070015 -0.5826146 -0.0469419 -0.1441404 -0.01076 -0.2993188 -0.7020881 -0.1930761 -0.0022665 -0.2798647 -0.6870521 -0.0021475 -0.0046117 0.0021236 -0.2118726 -0.9347139 0.1370257 -0.0025395 0.2092953 -0.525092 -0.0029372 -0.0095812 0.0017455 -0.2108235 0.7595003 0.080454 0.4311888 -0.2068903 1.591914 -0.0700343 0.3323245 -0.1005901 0.3688887 2.1005768 0.1865703 0.0072364 0.2575017 1.031778 0.0042037 0.0291897 -0.0058387 0.1802774 1.0258368 -0.3802637 -0.0206878 0.0643253 0.1870988 0.0040489 -0.0100104 -0.064626 0.035934 -0.5289282 0.2055118 0.0090845 0.1678094 0.0661831 -0.006861 0.0148432 0.0009014 -0.0166627 -0.8178547 0.1048116 0.0065733 -0.309986 -0.2207388 0.0019401 0.0050565 -0.0083139 0.0471166 -0.5072201 -0.2583129 0.0139877 -0.444614 -0.206091 0.0132521 0.0159619 0.000654 0.0452206 1.1327829 0.0369502 -0.0223179 -0.0206004 1.161768 -0.0156071 -0.0059546 -0.0039362 0.1116961 -0.4074619 0.0027706 -0.055601 0.2496183 -0.4417348 0.0011853 -0.0391147 0.0274237 0.0402129 0.5248527 0.0023839 -0.0008511 -0.138155 0.049663 -0.0033056 0.0044148 0.0012519 -0.0660777 -0.0385501 -0.2450334 -0.0074454 0.1327457 0.009426 -0.0036506 0.0099643 0.017504 -0.090189 -0.8063335 -0.118779 0.0024271 -0.0485308 -0.2190638 0.0005685 -0.0073461 0.0078649 0.0596473 0.1175437 0.1826466 -0.0015914 0.2093321 0.0495525 -0.0066253 0.0055282 0.0599302 -0.0485668 -0.1097644 0.0604923 -0.0022631 -0.2133917 0.1573417 0.0046027 -0.0034682 0.000037 -0.1039521 0.0544795 0.215583 -0.0070599 0.2788153 -0.0185756 0.0015936 -0.0207128 0.0135381 -0.1213973 0.1597236 -0.04514 -0.0100867 -0.0524783 -0.0801148 0.0012988 -0.0129056 0.0071332 -0.1340131 0.1600737 -0.0022093 0.0000648 0.0031064 0.1140664 0.000424 -0.0031157 -0.0054815 0.1716477 0.1699329 0.0093264 0.0143049 -0.0036693 0.0490136 -0.0019006 -0.0041584 -0.0127483 0.1559298 0.1719068 0.0123988 0.0066509 0.0048387 0.1546104 0.0009441 -0.0138218 -0.0130794 0.1739653 0.090885 -0.0012683 0.0016465 0.0546045 -0.0103742 -0.0011537 -0.000009 -0.0008144 0.1613772 -0.0229197 -0.0759975 0.0053339 -0.1060506 0.0103078 0.0019146 0.0052251 -0.0023956 0.1540231 -0.0925953 0.0380658 0.0064017 0.0484119 0.0874959 -0.0007974 0.014458 -0.0067227 0.1606303 unknown
polarizability: 313.5798598|-0.5106513|210.4620269|4.0543635|-1.6622418|64.6469302 unknown
InChI: InChI=1S/C13H6N2O5/c16-13-9-4-2-1-3-8(9)12-10(13)5-7(14(17)18)6-11(12)15(19)20/h1-6H
charge 0 multiplicity 1
26 atoms
O  0.894488 -3.295703 0.036652
O  -1.313662 3.541064 -0.432028
O  0.70758 3.131651 0.528097
O  -4.290187 -1.933607 -0.015728
O  -4.781495 0.297306 -0.02942
N  -0.4165 2.741299 0.032685
N  -3.951443 -0.689274 -0.015515
C  0.276396 0.268257 0.045434
C  1.774231 0.212474 0.027058
C  -0.210781 -1.084765 0.03981
C  2.165316 -1.16779 0.011133
C  0.955587 -2.0381 0.031042
C  -0.716086 1.284308 0.020953
C  -1.559971 -1.434213 0.027864
C  2.779746 1.202828 0.004163
C  -2.499306 -0.376545 0.001858
C  -2.096868 0.966189 -0.013045
C  3.507513 -1.57062 -0.026313
C  4.139496 0.797156 -0.04575
C  4.508668 -0.568597 -0.057464
H  -1.880848 -2.47965 0.031179
H  2.529852 2.262498 0.040844
H  -2.841486 1.765689 -0.04962
H  3.758377 -2.636189 -0.034238
H  4.919109 1.566043 -0.066087
H  5.566777 -0.848007 -0.087966
