program: Gaussian 09
title: 000244565
version: EM64L-G09RevD.01
frameworkgroup: C1[X(C21H22OSi)]
method: RPBEPBE
basis: SDD
operation: Freq
keyword: #p
keyword: freq=noraman
keyword: PBEPBE/SDD
title: #p freq=noraman PBEPBE/SDD
converged: YES YES NO NO
title: Mulliken charges:
elementType: Si O C C C C C C C C C C C C C C C C C C C C C H H H H H H H H H H H H H H H H H H H H H H
charge: 1.403548 -0.759236 -0.242289 -0.229447 -0.217885 -0.274535 -0.293809 -0.300968 -0.290934 -0.313324 -0.298620 -0.399788 -0.394046 -0.411971 -0.381281 -0.399734 -0.375153 0.432328 0.434287 0.431939 -0.808894 -0.805471 -0.806739 0.225423 0.250057 0.241310 0.278011 0.248552 0.255794 0.370146 0.228377 0.230947 0.230109 0.227327 0.231047 0.228045 0.235702 0.223244 0.224422 0.236857 0.225995 0.225182 0.226865 0.234122 0.224486
chargesum: 0.00000
title: Mulliken charges with hydrogens summed into heavy atoms:
elementType: Si O C C C C C C C C C C C C C C C C C C C C C
charge: 1.403548 -0.389090 -0.242289 -0.229447 -0.217885 -0.049111 -0.043752 -0.059658 -0.012923 -0.064772 -0.042826 -0.171411 -0.163099 -0.181862 -0.153954 -0.168687 -0.147108 0.432328 0.434287 0.431939 -0.125526 -0.117437 -0.121267
polarizability: 2.97028232e+02 2.42105847e+00 2.71500926e+02 -3.47759655e+00 -1.94528183e+01 1.96578505e+02
1716.lowfreq: -11.5492 -6.8954 -2.2519 -0.0004 0.0007 0.0012 14.9494 23.4558 24.6671
frequency: 14.0466 23.2262 24.5315 27.5417 34.5603 37.7928 42.4002 42.9292 50.8695 101.1296 105.0959 128.1838 144.9507 172.4258 197.9353 207.8075 227.0313 234.5986 273.3444 279.3527 308.0151 326.9187 343.2846 353.8549 386.5775 394.3886 397.4187 400.7055 436.9655 448.8243 501.7802 503.4278 515.6162 579.6187 628.2312 629.1417 633.9534 635.5221 643.8276 714.0219 723.1632 726.1336 728.1131 789.6389 793.3882 794.6834 811.6172 814.3706 819.0526 858.1726 862.8592 863.6660 884.9452 955.6258 959.1907 964.6986 979.4785 982.7034 983.9285 984.7395 986.3064 990.5215 1012.6425 1012.9406 1014.1681 1046.9000 1047.0644 1047.8091 1096.0961 1103.7714 1109.5840 1117.3035 1120.0435 1121.6084 1196.7009 1198.7313 1202.3353 1221.5363 1222.4887 1225.5898 1301.3454 1305.6597 1307.7443 1346.9045 1350.4016 1351.5218 1392.9896 1394.3388 1395.3995 1395.6965 1396.0195 1396.5979 1468.5723 1468.9487 1469.5100 1472.6322 1472.6990 1473.2627 1489.9195 1491.0083 1492.8204 1563.0966 1565.0457 1567.0997 1610.8505 1611.1628 1612.8837 2973.7638 2974.6089 2974.7389 3054.8797 3055.5871 3056.3877 3083.5505 3084.5906 3085.5378 3102.3251 3105.5364 3108.2648 3110.4001 3112.1345 3115.7253 3128.7779 3129.4196 3130.4670 3135.9010 3136.9795 3150.0364 3693.7225
redmass: 3.5576 1.1261 3.2739 3.6619 4.0484 3.0639 1.0309 1.1518 3.4306 4.6361 4.3010 4.3145 4.1665 3.3625 3.6853 4.5578 1.9583 3.4482 3.7150 4.4398 3.9717 3.1647 2.6934 2.7464 4.2933 2.8338 2.8614 2.8426 6.2062 5.4690 3.1382 2.8601 3.0353 5.3137 6.3701 5.5348 6.9344 6.2357 6.1492 4.8703 3.4691 3.5537 3.5105 4.5306 4.9292 4.9806 1.3406 1.3515 1.3536 1.2483 1.2446 1.2488 1.4658 1.3183 1.2963 1.2819 1.3895 1.3922 1.4054 1.4092 1.4140 1.3472 3.5595 3.4742 3.4383 1.5732 1.5735 1.5772 3.6887 3.8599 3.8425 1.3975 1.3843 1.4042 1.1206 1.1216 1.1267 2.8198 2.7890 2.7582 1.3508 1.3165 1.3273 3.5952 4.0786 4.1265 3.2810 3.1977 3.0630 1.2440 1.2328 1.2235 1.0941 1.0898 1.0911 1.0600 1.0555 1.0542 2.3904 2.3727 2.4004 5.3417 5.4991 5.5558 6.1104 6.1118 6.1358 1.0385 1.0385 1.0386 1.0949 1.0952 1.0948 1.0998 1.0997 1.0999 1.0870 1.0869 1.0867 1.0873 1.0872 1.0889 1.0960 1.0961 1.0959 1.0972 1.0974 1.0953 1.0671
irintensity: 0.0137 0.3367 0.3384 0.1125 0.1395 0.4328 0.3487 0.4350 0.9016 0.0862 1.2335 6.2881 1.8325 8.2790 11.3321 11.1192 113.4319 8.1581 20.7858 0.0272 12.8208 2.4995 2.6607 0.7026 1.3965 0.2212 0.6214 0.3051 35.4387 31.2478 52.4539 30.2940 100.7560 0.9347 25.0149 52.6760 2.5742 32.3187 56.1721 156.2500 4.9640 50.1123 16.9488 9.3361 11.7720 11.8123 23.6440 40.4413 16.3993 1.3368 0.5182 1.2108 65.3264 0.3814 0.2763 0.2666 0.8384 0.3177 0.6801 1.3953 2.4067 0.3764 0.9123 2.7912 2.9575 18.5654 22.1356 21.1944 11.6172 87.0466 68.0404 0.3132 6.4944 0.2318 9.4563 11.6271 5.7984 0.5427 0.1007 0.1019 3.1672 8.9887 1.7460 1.8805 6.2099 3.5113 3.3577 9.3735 4.7196 9.9762 10.0151 11.2415 16.0733 17.8956 18.3365 13.0633 12.9716 12.7929 8.5383 11.9085 14.9560 3.5902 1.6992 1.1653 20.4792 26.6667 16.6909 45.4665 52.1874 22.5598 23.4467 22.7237 22.1107 17.7241 17.3622 17.1258 15.9273 14.8204 6.0785 13.6368 11.2765 24.3737 3.5648 52.6129 44.1359 15.3077 4.5539 9.0798 35.6753
temp: 298.150 k
press: 1.00000 atm
elementType: 14 8 6 6 6 6 6 6 6 6 6 6 6 6 6 6 6 6 6 6 6 6 6 1 1 1 1 1 1 1 1 1 1 1 1 1 1 1 1 1 1 1 1 1 1
symmnumber: 1
zpe: 952189.3 jmol-1
zpe.correction: 0.362670 hartree
zpe.thermalcorrener: 0.386740 hartree
zpe.thermalcorrenthalpy: 0.387684 hartree
zpe.thermalcorrgfe: 0.303637 hartree
zpe.sumelectzpe: -1176.476666 hartree
zpe.sumelectthermal: -1176.452595 hartree
zpe.sumelectthermalent: -1176.451651 hartree
zpe.sumelectthermalfe: -1176.535698 hartree
dipole: 1.0566 1.3023 -1.0050
dipole: 1.9551
quadrupole: -125.9401 -129.5441 -137.9948
quadrupole: 0.4681 2.6538 -0.6101
quadrupole: 5.2195 1.6156 -6.8351 0.4681 2.6538 -0.6101
hfenergy: -1176.8393353 hartree
pointgroup: C01 [X(C21H22O1Si1)]
dipole: -0.1409906 -0.6418363 -0.3997749 debye
polarizability: 287.5873873|13.6547969|278.8405341|-12.4886066|19.459452|198.6797407 unknown
InChI: InChI=1S/C21H22OSi/c1-16-4-10-19(11-5-16)23(22,20-12-6-17(2)7-13-20)21-14-8-18(3)9-15-21/h4-15,22H,1-3H3
charge 0 multiplicity 1
45 atoms
Si 0.057246 0.014152 0.862701
O  0.19014 0.186679 2.596356
C  0.918417 1.587767 0.245065
C  0.945899 -1.551197 0.238826
C  -1.795291 -0.068516 0.426317
C  1.04734 1.86807 -1.141832
C  2.319172 -1.505926 -0.128496
C  -2.26959 -0.62266 -0.793175
C  1.452316 2.524471 1.168881
C  0.289373 -2.812051 0.183424
C  -2.75285 0.487489 1.318509
C  1.688837 3.044101 -1.588753
C  3.005665 -2.671249 -0.533023
C  -3.647288 -0.621085 -1.107637
C  2.093056 3.700133 0.719055
C  0.977651 -3.977551 -0.219391
C  -4.128868 0.48462 1.004946
C  2.218997 3.982795 -0.665588
C  2.349265 -3.928609 -0.579988
C  -4.600856 -0.070989 -0.213247
C  2.878287 5.264278 -1.146286
C  3.098168 -5.187058 -0.982802
C  -6.084917 -0.093809 -0.536813
H  0.649669 1.165485 -1.886306
H  2.85435 -0.548458 -0.106195
H  -1.561898 -1.061591 -1.508466
H  1.36475 2.317325 2.241213
H  -0.773315 -2.885438 0.44819
H  -2.411745 0.928302 2.263418
H  0.034316 -0.583504 3.186036
H  1.778776 3.236937 -2.665231
H  4.063629 -2.605853 -0.816679
H  -3.986595 -1.051661 -2.058108
H  2.501433 4.407657 1.451942
H  0.444723 -4.93607 -0.256715
H  -4.846748 0.922431 1.710314
H  2.14085 6.088111 -1.212741
H  3.322739 5.140413 -2.149633
H  3.675003 5.594151 -0.456049
H  3.553927 -5.675571 -0.099347
H  3.915719 -4.962977 -1.690479
H  2.427014 -5.92571 -1.455382
H  -6.588427 0.826081 -0.189283
H  -6.586907 -0.947763 -0.041339
H  -6.261634 -0.19215 -1.622111
